{"text_format":"1","workbook":"xlsx","n_sheets":3,"sheets":["Test Score Input","Score Plot (ranges)","Score Plot (bars)"],"not_rendered":{"charts":4,"images":0,"macros":0,"external_links":0,"defined_names":3,"comments":0,"pivot_tables":0},"unopened":[],"bounds":{"document_bytes":16777216,"sheet_cells":100000,"rows_first":2000,"rows_last":500,"rows_between":2000,"halvings":0,"cell_chars":16384,"cell_head_chars":4096},"cells_cut":0,"cells_raw":0,"read":"whole","date_system":"1904"}

{"sheet":"Test Score Input","index":0,"n_rows":45,"n_cols":11,"rows_kept":45,"cut":false,"hidden":false,"merged":[[43,2,43,3],[44,2,44,3],[41,2,41,3],[42,2,42,3],[9,2,9,3],[39,2,39,3],[40,2,40,3],[34,2,34,3],[35,2,35,3],[33,2,33,3],[23,2,23,3],[24,2,24,3],[25,2,25,3],[26,2,26,3],[37,2,37,3],[30,2,30,3],[29,2,29,3],[32,2,32,3],[31,2,31,3],[36,2,36,3],[21,2,21,3],[22,2,22,3],[38,2,38,3],[10,2,10,3],[11,2,11,3],[12,2,12,3],[13,2,13,3],[14,2,14,3],[27,2,27,3],[28,2,28,3],[15,2,15,3],[16,2,16,3],[17,2,17,3],[18,2,18,3],[19,2,19,3],[20,2,20,3]]}
[null,null,null,null,"-3 sd","-2 sd","-1 sd","mean","+1 sd","+2 sd","+3 sd"]
[null,"Metric1:","Standard Scores","(m =100, s.d. = 15)",55,70,85,100,115,130,145]
[null,"Metric2:","T Scores","(m = 50, s.d. = 10)",20,30,40,50,60,70,80]
[null,"Metric3:","Scaled Scores","(m = 10, s.d. = 3)",1,4,7,10,13,16,19]
[null,"Metric4:","Binet Composites","(m = 100, s.d. = 16)",52,68,84,100,116,132,158]
[null,"Metric5:","Binet SASs","(m = 50, s.d. = 8)",26,34,42,50,58,66,74]
[null,"Metric6:","Stanines","(m = 5, s.d. = 1.96)",null,1.08,3.04,5,6.96,8.92]
[null,"Metric7:","NCEs","(m = 50, s.d. = 21.06)",null,7.88,28.94,50,71.06,92.12]
[]
[null,null,"Test",null,"Score","Metric","Converted"]
[null,1,"IVA",null,null,1,{"$f":"IF(F11=1,E11,IF(F11=2,ROUND((15*((E11-50)/10))+100,0),IF(F11=3,ROUND((15*((E11-10)/3))+100,0),IF(F11=4,ROUND((15*((E11-100)/16))+100,0),IF(F11=5,ROUND((15*((E11-50)/8))+100,0),IF(F11=6,ROUND((15*((E11-5)/1.96))+100,0),IF(F11=7,ROUND((15*((E11-50)/21.06))+100,0),\"\")))))))","v":0},"       Steps for template"]
[null,{"$f":"B11+1","v":2},"FS Response",null,99,1,{"$f":"IF(F12=1,E12,IF(F12=2,ROUND((15*((E12-50)/10))+100,0),IF(F12=3,ROUND((15*((E12-10)/3))+100,0),IF(F12=4,ROUND((15*((E12-100)/16))+100,0),IF(F12=5,ROUND((15*((E12-50)/8))+100,0),IF(F12=6,ROUND((15*((E12-5)/1.96))+100,0),IF(F12=7,ROUND((15*((E12-50)/21.06))+100,0),\"\")))))))","v":99}]
[null,{"$f":"B12+1","v":3},"FS Attention",null,70,1,70,"   1. Enter the name of the test, cluster or subtest"]
[null,4,null,null,null,1,0,"   2. Enter the score obtained"]
[null,5,"WJ III Ach",null,null,1,0,"   3. Choose the metric for the score (i.e. 1 through 7)"]
[null,6,"LWI",null,81,1,81]
[null,7,"WA",null,93,1,93,"   The template converts each score to a common metric"]
[null,8,"Cal",null,93,1,93,"   with a mean of 100 and a standard deviation of 15."]
[null,9,"MF",null,82,1,82," "]
[null,10,"Sp",null,74,1,74,"   The template automatically plots the converted scores"]
[null,11,"PC",null,86,1,86,"   onto a chart.  Press the \"Score Plot\" tab to see results."]
[null,12,"Aprob",null,114,1,114]
[null,13,"WS",null,89,1,89]
[null,14,null,null,null,1,0]
[null,15,"Gray",null,null,1,0]
[null,16,"Acc",null,5,3,75]
[null,17,"Rate",null,5,3,75]
[null,18,"Comp",null,12,3,110]
[null,19,null,null,null,1,0]
[null,20,"Reynold Depression",null,100,1,100]
[null,21,null,null,null,1,0]
[null,22,"MASC",null,45,2,93]
[null,23,null,null,null,1,0]
[null,24,"CBCL",null,null,1,0]
[null,25,"Total",null,58,2,112]
[null,26,"Anxious",null,62,2,118]
[null,27,"Withdrawn",null,54,2,106]
[null,28,"Somatic",null,53,2,105]
[null,{"$f":"B38+1","v":29},"Social",null,62,2,{"$f":"IF(F39=1,E39,IF(F39=2,ROUND((15*((E39-50)/10))+100,0),IF(F39=3,ROUND((15*((E39-10)/3))+100,0),IF(F39=4,ROUND((15*((E39-100)/16))+100,0),IF(F39=5,ROUND((15*((E39-50)/8))+100,0),IF(F39=6,ROUND((15*((E39-5)/1.96))+100,0),IF(F39=7,ROUND((15*((E39-50)/21.06))+100,0),\"\")))))))","v":118}]
[null,30,"Thought",null,64,2,121]
[null,31,"Attention",null,51,2,102]
[null,32,"Rule",null,53,2,105]
[null,33,"Aggressive",null,61,2,117]
[null,34,"DSM IV",null,65,2,123]
[null,35,null,null,null,1,0]

{"sheet":"Score Plot (ranges)","index":1,"n_rows":148,"n_cols":13,"rows_kept":148,"cut":false,"hidden":false,"merged":[]}
[]
[]
[]
[]
[]
[]
[]
[]
[]
[]
[]
[]
[]
[]
[]
[]
[]
[]
[]
[]
[]
[]
[]
[]
[]
[]
[]
[]
[]
[]
[]
[]
[]
[]
[]
[]
[]
[]
[]
[]
[]
[]
[]
[]
[]
[]
[]
[]
[]
[]
[]
[]
[]
[]
[]
[]
[]
[]
[]
[]
[]
[]
[]
[]
[]
[]
[]
[]
[]
[]
[]
[]
[]
[]
[]
[]
[]
[]
[]
[]
[]
[]
[]
[]
[]
[]
[]
[]
[]
[]
[]
[]
[]
[]
[]
[]
[]
[]
[]
[]
[]
[]
[null,"Test","Score",null,null,"original"]
[null,{"$f":"IF('Test Score Input'!C11=\"\",\"x\",'Test Score Input'!C11&\" (score= \"&F104&\")\")","v":"IVA (score= )"},{"$f":"IF('Test Score Input'!G11=\"\",40,'Test Score Input'!G11-5)","v":-5},10,{"$f":"160-(C104+D104)","v":155},{"$f":"IF('Test Score Input'!E11=\"\",\"\",'Test Score Input'!E11)","v":""}]
[null,{"$f":"IF('Test Score Input'!C12=\"\",\"x\",'Test Score Input'!C12&\" (score= \"&F105&\")\")","v":"FS Response (score= 99)"},{"$f":"IF('Test Score Input'!G12=\"\",40,'Test Score Input'!G12-5)","v":94},10,{"$f":"160-(C105+D105)","v":56},{"$f":"IF('Test Score Input'!E12=\"\",\"\",'Test Score Input'!E12)","v":99}]
[null,{"$f":"IF('Test Score Input'!C13=\"\",\"x\",'Test Score Input'!C13&\" (score= \"&F106&\")\")","v":"FS Attention (score= 70)"},{"$f":"IF('Test Score Input'!G13=\"\",40,'Test Score Input'!G13-5)","v":65},10,85,{"$f":"IF('Test Score Input'!E13=\"\",\"\",'Test Score Input'!E13)","v":70}]
[null,{"$f":"IF('Test Score Input'!C14=\"\",\"x\",'Test Score Input'!C14&\" (score= \"&F107&\")\")","v":"x"},{"$f":"IF('Test Score Input'!G14=\"\",40,'Test Score Input'!G14-5)","v":-5},10,155,{"$f":"IF('Test Score Input'!E14=\"\",\"\",'Test Score Input'!E14)","v":""}]
[null,{"$f":"IF('Test Score Input'!C15=\"\",\"x\",'Test Score Input'!C15&\" (score= \"&F108&\")\")","v":"WJ III Ach (score= )"},{"$f":"IF('Test Score Input'!G15=\"\",40,'Test Score Input'!G15-5)","v":-5},10,155,{"$f":"IF('Test Score Input'!E15=\"\",\"\",'Test Score Input'!E15)","v":""}]
[null,{"$f":"IF('Test Score Input'!C16=\"\",\"x\",'Test Score Input'!C16&\" (score= \"&F109&\")\")","v":"LWI (score= 81)"},{"$f":"IF('Test Score Input'!G16=\"\",40,'Test Score Input'!G16-5)","v":76},10,74,{"$f":"IF('Test Score Input'!E16=\"\",\"\",'Test Score Input'!E16)","v":81}]
[null,{"$f":"IF('Test Score Input'!C17=\"\",\"x\",'Test Score Input'!C17&\" (score= \"&F110&\")\")","v":"WA (score= 93)"},{"$f":"IF('Test Score Input'!G17=\"\",40,'Test Score Input'!G17-5)","v":88},10,62,{"$f":"IF('Test Score Input'!E17=\"\",\"\",'Test Score Input'!E17)","v":93}]
[null,{"$f":"IF('Test Score Input'!C18=\"\",\"x\",'Test Score Input'!C18&\" (score= \"&F111&\")\")","v":"Cal (score= 93)"},{"$f":"IF('Test Score Input'!G18=\"\",40,'Test Score Input'!G18-5)","v":88},10,62,{"$f":"IF('Test Score Input'!E18=\"\",\"\",'Test Score Input'!E18)","v":93}]
[null,{"$f":"IF('Test Score Input'!C19=\"\",\"x\",'Test Score Input'!C19&\" (score= \"&F112&\")\")","v":"MF (score= 82)"},{"$f":"IF('Test Score Input'!G19=\"\",40,'Test Score Input'!G19-5)","v":77},10,73,{"$f":"IF('Test Score Input'!E19=\"\",\"\",'Test Score Input'!E19)","v":82}]
[null,{"$f":"IF('Test Score Input'!C20=\"\",\"x\",'Test Score Input'!C20&\" (score= \"&F113&\")\")","v":"Sp (score= 74)"},{"$f":"IF('Test Score Input'!G20=\"\",40,'Test Score Input'!G20-5)","v":69},10,81,{"$f":"IF('Test Score Input'!E20=\"\",\"\",'Test Score Input'!E20)","v":74}]
[null,{"$f":"IF('Test Score Input'!C21=\"\",\"x\",'Test Score Input'!C21&\" (score= \"&F114&\")\")","v":"PC (score= 86)"},{"$f":"IF('Test Score Input'!G21=\"\",40,'Test Score Input'!G21-5)","v":81},10,69,{"$f":"IF('Test Score Input'!E21=\"\",\"\",'Test Score Input'!E21)","v":86}]
[null,{"$f":"IF('Test Score Input'!C22=\"\",\"x\",'Test Score Input'!C22&\" (score= \"&F115&\")\")","v":"Aprob (score= 114)"},{"$f":"IF('Test Score Input'!G22=\"\",40,'Test Score Input'!G22-5)","v":109},10,41,{"$f":"IF('Test Score Input'!E22=\"\",\"\",'Test Score Input'!E22)","v":114}]
[null,{"$f":"IF('Test Score Input'!C23=\"\",\"x\",'Test Score Input'!C23&\" (score= \"&F116&\")\")","v":"WS (score= 89)"},{"$f":"IF('Test Score Input'!G23=\"\",40,'Test Score Input'!G23-5)","v":84},10,66,{"$f":"IF('Test Score Input'!E23=\"\",\"\",'Test Score Input'!E23)","v":89}]
[null,{"$f":"IF('Test Score Input'!C24=\"\",\"x\",'Test Score Input'!C24&\" (score= \"&F117&\")\")","v":"x"},{"$f":"IF('Test Score Input'!G24=\"\",40,'Test Score Input'!G24-5)","v":-5},10,155,{"$f":"IF('Test Score Input'!E24=\"\",\"\",'Test Score Input'!E24)","v":""}]
[null,{"$f":"IF('Test Score Input'!C25=\"\",\"x\",'Test Score Input'!C25&\" (score= \"&F118&\")\")","v":"Gray (score= )"},{"$f":"IF('Test Score Input'!G25=\"\",40,'Test Score Input'!G25-5)","v":-5},10,155,{"$f":"IF('Test Score Input'!E25=\"\",\"\",'Test Score Input'!E25)","v":""}]
[null,{"$f":"IF('Test Score Input'!C26=\"\",\"x\",'Test Score Input'!C26&\" (score= \"&F119&\")\")","v":"Acc (score= 5)"},{"$f":"IF('Test Score Input'!G26=\"\",40,'Test Score Input'!G26-5)","v":70},10,80,{"$f":"IF('Test Score Input'!E26=\"\",\"\",'Test Score Input'!E26)","v":5}]
[null,{"$f":"IF('Test Score Input'!C27=\"\",\"x\",'Test Score Input'!C27&\" (score= \"&F120&\")\")","v":"Rate (score= 5)"},{"$f":"IF('Test Score Input'!G27=\"\",40,'Test Score Input'!G27-5)","v":70},10,80,{"$f":"IF('Test Score Input'!E27=\"\",\"\",'Test Score Input'!E27)","v":5}]
[null,{"$f":"IF('Test Score Input'!C28=\"\",\"x\",'Test Score Input'!C28&\" (score= \"&F121&\")\")","v":"Comp (score= 12)"},{"$f":"IF('Test Score Input'!G28=\"\",40,'Test Score Input'!G28-5)","v":105},10,45,{"$f":"IF('Test Score Input'!E28=\"\",\"\",'Test Score Input'!E28)","v":12}]
[null,{"$f":"IF('Test Score Input'!C29=\"\",\"x\",'Test Score Input'!C29&\" (score= \"&F122&\")\")","v":"x"},{"$f":"IF('Test Score Input'!G29=\"\",40,'Test Score Input'!G29-5)","v":-5},10,{"$f":"160-(C122+D122)","v":155},{"$f":"IF('Test Score Input'!E29=\"\",\"\",'Test Score Input'!E29)","v":""}]
[null,{"$f":"IF('Test Score Input'!C30=\"\",\"x\",'Test Score Input'!C30&\" (score= \"&F123&\")\")","v":"Reynold Depression (score= 100)"},{"$f":"IF('Test Score Input'!G30=\"\",40,'Test Score Input'!G30-5)","v":95},10,55,{"$f":"IF('Test Score Input'!E30=\"\",\"\",'Test Score Input'!E30)","v":100}]
[null,{"$f":"IF('Test Score Input'!C31=\"\",\"x\",'Test Score Input'!C31&\" (score= \"&F124&\")\")","v":"x"},{"$f":"IF('Test Score Input'!G31=\"\",40,'Test Score Input'!G31-5)","v":-5},10,155,{"$f":"IF('Test Score Input'!E31=\"\",\"\",'Test Score Input'!E31)","v":""}]
[null,{"$f":"IF('Test Score Input'!C32=\"\",\"x\",'Test Score Input'!C32&\" (score= \"&F125&\")\")","v":"MASC (score= 45)"},{"$f":"IF('Test Score Input'!G32=\"\",40,'Test Score Input'!G32-5)","v":88},10,62,{"$f":"IF('Test Score Input'!E32=\"\",\"\",'Test Score Input'!E32)","v":45}]
[null,{"$f":"IF('Test Score Input'!C33=\"\",\"x\",'Test Score Input'!C33&\" (score= \"&F126&\")\")","v":"x"},{"$f":"IF('Test Score Input'!G33=\"\",40,'Test Score Input'!G33-5)","v":-5},10,155,{"$f":"IF('Test Score Input'!E33=\"\",\"\",'Test Score Input'!E33)","v":""}]
[null,{"$f":"IF('Test Score Input'!C34=\"\",\"x\",'Test Score Input'!C34&\" (score= \"&F127&\")\")","v":"CBCL (score= )"},{"$f":"IF('Test Score Input'!G34=\"\",40,'Test Score Input'!G34-5)","v":-5},10,155,{"$f":"IF('Test Score Input'!E34=\"\",\"\",'Test Score Input'!E34)","v":""}]
[null,{"$f":"IF('Test Score Input'!C35=\"\",\"x\",'Test Score Input'!C35&\" (score= \"&F128&\")\")","v":"Total (score= 58)"},{"$f":"IF('Test Score Input'!G35=\"\",40,'Test Score Input'!G35-5)","v":107},10,43,{"$f":"IF('Test Score Input'!E35=\"\",\"\",'Test Score Input'!E35)","v":58}]
[null,{"$f":"IF('Test Score Input'!C36=\"\",\"x\",'Test Score Input'!C36&\" (score= \"&F129&\")\")","v":"Anxious (score= 62)"},{"$f":"IF('Test Score Input'!G36=\"\",40,'Test Score Input'!G36-5)","v":113},10,37,{"$f":"IF('Test Score Input'!E36=\"\",\"\",'Test Score Input'!E36)","v":62}]
[null,{"$f":"IF('Test Score Input'!C37=\"\",\"x\",'Test Score Input'!C37&\" (score= \"&F130&\")\")","v":"Withdrawn (score= 54)"},{"$f":"IF('Test Score Input'!G37=\"\",40,'Test Score Input'!G37-5)","v":101},10,49,{"$f":"IF('Test Score Input'!E37=\"\",\"\",'Test Score Input'!E37)","v":54}]
[null,{"$f":"IF('Test Score Input'!C38=\"\",\"x\",'Test Score Input'!C38&\" (score= \"&F131&\")\")","v":"Somatic (score= 53)"},{"$f":"IF('Test Score Input'!G38=\"\",40,'Test Score Input'!G38-5)","v":100},10,50,{"$f":"IF('Test Score Input'!E38=\"\",\"\",'Test Score Input'!E38)","v":53}]
[null,{"$f":"IF('Test Score Input'!C39=\"\",\"x\",'Test Score Input'!C39&\" (score= \"&F132&\")\")","v":"Social (score= 62)"},{"$f":"IF('Test Score Input'!G39=\"\",40,'Test Score Input'!G39-5)","v":113},10,37,{"$f":"IF('Test Score Input'!E39=\"\",\"\",'Test Score Input'!E39)","v":62}]
[null,{"$f":"IF('Test Score Input'!C40=\"\",\"x\",'Test Score Input'!C40&\" (score= \"&F133&\")\")","v":"Thought (score= 64)"},{"$f":"IF('Test Score Input'!G40=\"\",40,'Test Score Input'!G40-5)","v":116},10,34,{"$f":"IF('Test Score Input'!E40=\"\",\"\",'Test Score Input'!E40)","v":64}]
[null,{"$f":"IF('Test Score Input'!C41=\"\",\"x\",'Test Score Input'!C41&\" (score= \"&F134&\")\")","v":"Attention (score= 51)"},{"$f":"IF('Test Score Input'!G41=\"\",40,'Test Score Input'!G41-5)","v":97},10,53,{"$f":"IF('Test Score Input'!E41=\"\",\"\",'Test Score Input'!E41)","v":51}]
[null,{"$f":"IF('Test Score Input'!C42=\"\",\"x\",'Test Score Input'!C42&\" (score= \"&F135&\")\")","v":"Rule (score= 53)"},{"$f":"IF('Test Score Input'!G42=\"\",40,'Test Score Input'!G42-5)","v":100},10,50,{"$f":"IF('Test Score Input'!E42=\"\",\"\",'Test Score Input'!E42)","v":53}]
[null,{"$f":"IF('Test Score Input'!C43=\"\",\"x\",'Test Score Input'!C43&\" (score= \"&F136&\")\")","v":"Aggressive (score= 61)"},{"$f":"IF('Test Score Input'!G43=\"\",40,'Test Score Input'!G43-5)","v":112},10,38,{"$f":"IF('Test Score Input'!E43=\"\",\"\",'Test Score Input'!E43)","v":61}]
[null,{"$f":"IF('Test Score Input'!C44=\"\",\"x\",'Test Score Input'!C44&\" (score= \"&F137&\")\")","v":"DSM IV (score= 65)"},{"$f":"IF('Test Score Input'!G44=\"\",40,'Test Score Input'!G44-5)","v":118},10,32,{"$f":"IF('Test Score Input'!E44=\"\",\"\",'Test Score Input'!E44)","v":65}]
[null,{"$f":"IF('Test Score Input'!C45=\"\",\"x\",'Test Score Input'!C45&\" (score= \"&F138&\")\")","v":"x"},{"$f":"IF('Test Score Input'!G45=\"\",40,'Test Score Input'!G45-5)","v":-5},10,155,{"$f":"IF('Test Score Input'!E45=\"\",\"\",'Test Score Input'!E45)","v":""}]
[null,{"$f":"IF('Test Score Input'!C46=\"\",\"x\",'Test Score Input'!C46&\" (score= \"&F139&\")\")","v":"x"},{"$f":"IF('Test Score Input'!G46=\"\",40,'Test Score Input'!G46-5)","v":40},10,{"$f":"160-(C139+D139)","v":110},{"$f":"IF('Test Score Input'!E46=\"\",\"\",'Test Score Input'!E46)","v":""}]
[null,{"$f":"IF('Test Score Input'!C47=\"\",\"x\",'Test Score Input'!C47&\" (score= \"&F140&\")\")","v":"x"},{"$f":"IF('Test Score Input'!G47=\"\",40,'Test Score Input'!G47-5)","v":40},{"$f":"IF('Test Score Input'!E47=\"\",\"\",'Test Score Input'!E47)","v":""}]
[null,{"$f":"IF('Test Score Input'!C48=\"\",\"x\",'Test Score Input'!C48&\" (score= \"&F141&\")\")","v":"x"},{"$f":"IF('Test Score Input'!G48=\"\",40,'Test Score Input'!G48)","v":40},{"$f":"IF('Test Score Input'!E48=\"\",\"\",'Test Score Input'!E48)","v":""}]
[]
[]
[]
[]
[]
[]
[1,3,9,22,50,68,76,68,50,22,9,3,1]

{"sheet":"Score Plot (bars)","index":2,"n_rows":148,"n_cols":13,"rows_kept":148,"cut":false,"hidden":false,"merged":[]}
[]
[]
[]
[]
[]
[]
[]
[]
[]
[]
[]
[]
[]
[]
[]
[]
[]
[]
[]
[]
[]
[]
[]
[]
[]
[]
[]
[]
[]
[]
[]
[]
[]
[]
[]
[]
[]
[]
[]
[]
[]
[]
[]
[]
[]
[]
[]
[]
[]
[]
[]
[]
[]
[]
[]
[]
[]
[]
[]
[]
[]
[]
[]
[]
[]
[]
[]
[]
[]
[]
[]
[]
[]
[]
[]
[]
[]
[]
[]
[]
[]
[]
[]
[]
[]
[]
[]
[]
[]
[]
[]
[]
[]
[]
[]
[]
[]
[]
[]
[]
[]
[]
[null,"Test","Score","original"]
[null,{"$f":"IF('Test Score Input'!C11=\"\",\"x\",'Test Score Input'!C11&\" (score= \"&D104&\")\")","v":"IVA (score= )"},{"$f":"IF('Test Score Input'!G11=\"\",40,'Test Score Input'!G11)","v":0},{"$f":"IF('Test Score Input'!E11=\"\",\"\",'Test Score Input'!E11)","v":""}]
[null,{"$f":"IF('Test Score Input'!C12=\"\",\"x\",'Test Score Input'!C12&\" (score= \"&D105&\")\")","v":"FS Response (score= 99)"},{"$f":"IF('Test Score Input'!G12=\"\",40,'Test Score Input'!G12)","v":99},{"$f":"IF('Test Score Input'!E12=\"\",\"\",'Test Score Input'!E12)","v":99}]
[null,{"$f":"IF('Test Score Input'!C13=\"\",\"x\",'Test Score Input'!C13&\" (score= \"&D106&\")\")","v":"FS Attention (score= 70)"},{"$f":"IF('Test Score Input'!G13=\"\",40,'Test Score Input'!G13)","v":70},{"$f":"IF('Test Score Input'!E13=\"\",\"\",'Test Score Input'!E13)","v":70}]
[null,{"$f":"IF('Test Score Input'!C14=\"\",\"x\",'Test Score Input'!C14&\" (score= \"&D107&\")\")","v":"x"},{"$f":"IF('Test Score Input'!G14=\"\",40,'Test Score Input'!G14)","v":0},{"$f":"IF('Test Score Input'!E14=\"\",\"\",'Test Score Input'!E14)","v":""}]
[null,{"$f":"IF('Test Score Input'!C15=\"\",\"x\",'Test Score Input'!C15&\" (score= \"&D108&\")\")","v":"WJ III Ach (score= )"},{"$f":"IF('Test Score Input'!G15=\"\",40,'Test Score Input'!G15)","v":0},{"$f":"IF('Test Score Input'!E15=\"\",\"\",'Test Score Input'!E15)","v":""}]
[null,{"$f":"IF('Test Score Input'!C16=\"\",\"x\",'Test Score Input'!C16&\" (score= \"&D109&\")\")","v":"LWI (score= 81)"},{"$f":"IF('Test Score Input'!G16=\"\",40,'Test Score Input'!G16)","v":81},{"$f":"IF('Test Score Input'!E16=\"\",\"\",'Test Score Input'!E16)","v":81}]
[null,{"$f":"IF('Test Score Input'!C17=\"\",\"x\",'Test Score Input'!C17&\" (score= \"&D110&\")\")","v":"WA (score= 93)"},{"$f":"IF('Test Score Input'!G17=\"\",40,'Test Score Input'!G17)","v":93},{"$f":"IF('Test Score Input'!E17=\"\",\"\",'Test Score Input'!E17)","v":93}]
[null,{"$f":"IF('Test Score Input'!C18=\"\",\"x\",'Test Score Input'!C18&\" (score= \"&D111&\")\")","v":"Cal (score= 93)"},{"$f":"IF('Test Score Input'!G18=\"\",40,'Test Score Input'!G18)","v":93},{"$f":"IF('Test Score Input'!E18=\"\",\"\",'Test Score Input'!E18)","v":93}]
[null,{"$f":"IF('Test Score Input'!C19=\"\",\"x\",'Test Score Input'!C19&\" (score= \"&D112&\")\")","v":"MF (score= 82)"},{"$f":"IF('Test Score Input'!G19=\"\",40,'Test Score Input'!G19)","v":82},{"$f":"IF('Test Score Input'!E19=\"\",\"\",'Test Score Input'!E19)","v":82}]
[null,{"$f":"IF('Test Score Input'!C20=\"\",\"x\",'Test Score Input'!C20&\" (score= \"&D113&\")\")","v":"Sp (score= 74)"},{"$f":"IF('Test Score Input'!G20=\"\",40,'Test Score Input'!G20)","v":74},{"$f":"IF('Test Score Input'!E20=\"\",\"\",'Test Score Input'!E20)","v":74}]
[null,{"$f":"IF('Test Score Input'!C21=\"\",\"x\",'Test Score Input'!C21&\" (score= \"&D114&\")\")","v":"PC (score= 86)"},{"$f":"IF('Test Score Input'!G21=\"\",40,'Test Score Input'!G21)","v":86},{"$f":"IF('Test Score Input'!E21=\"\",\"\",'Test Score Input'!E21)","v":86}]
[null,{"$f":"IF('Test Score Input'!C22=\"\",\"x\",'Test Score Input'!C22&\" (score= \"&D115&\")\")","v":"Aprob (score= 114)"},{"$f":"IF('Test Score Input'!G22=\"\",40,'Test Score Input'!G22)","v":114},{"$f":"IF('Test Score Input'!E22=\"\",\"\",'Test Score Input'!E22)","v":114}]
[null,{"$f":"IF('Test Score Input'!C23=\"\",\"x\",'Test Score Input'!C23&\" (score= \"&D116&\")\")","v":"WS (score= 89)"},{"$f":"IF('Test Score Input'!G23=\"\",40,'Test Score Input'!G23)","v":89},{"$f":"IF('Test Score Input'!E23=\"\",\"\",'Test Score Input'!E23)","v":89}]
[null,{"$f":"IF('Test Score Input'!C24=\"\",\"x\",'Test Score Input'!C24&\" (score= \"&D117&\")\")","v":"x"},{"$f":"IF('Test Score Input'!G24=\"\",40,'Test Score Input'!G24)","v":0},{"$f":"IF('Test Score Input'!E24=\"\",\"\",'Test Score Input'!E24)","v":""}]
[null,{"$f":"IF('Test Score Input'!C25=\"\",\"x\",'Test Score Input'!C25&\" (score= \"&D118&\")\")","v":"Gray (score= )"},{"$f":"IF('Test Score Input'!G25=\"\",40,'Test Score Input'!G25)","v":0},{"$f":"IF('Test Score Input'!E25=\"\",\"\",'Test Score Input'!E25)","v":""}]
[null,{"$f":"IF('Test Score Input'!C26=\"\",\"x\",'Test Score Input'!C26&\" (score= \"&D119&\")\")","v":"Acc (score= 5)"},{"$f":"IF('Test Score Input'!G26=\"\",40,'Test Score Input'!G26)","v":75},{"$f":"IF('Test Score Input'!E26=\"\",\"\",'Test Score Input'!E26)","v":5}]
[null,{"$f":"IF('Test Score Input'!C27=\"\",\"x\",'Test Score Input'!C27&\" (score= \"&D120&\")\")","v":"Rate (score= 5)"},{"$f":"IF('Test Score Input'!G27=\"\",40,'Test Score Input'!G27)","v":75},{"$f":"IF('Test Score Input'!E27=\"\",\"\",'Test Score Input'!E27)","v":5}]
[null,{"$f":"IF('Test Score Input'!C28=\"\",\"x\",'Test Score Input'!C28&\" (score= \"&D121&\")\")","v":"Comp (score= 12)"},{"$f":"IF('Test Score Input'!G28=\"\",40,'Test Score Input'!G28)","v":110},{"$f":"IF('Test Score Input'!E28=\"\",\"\",'Test Score Input'!E28)","v":12}]
[null,{"$f":"IF('Test Score Input'!C29=\"\",\"x\",'Test Score Input'!C29&\" (score= \"&D122&\")\")","v":"x"},{"$f":"IF('Test Score Input'!G29=\"\",40,'Test Score Input'!G29)","v":0},{"$f":"IF('Test Score Input'!E29=\"\",\"\",'Test Score Input'!E29)","v":""}]
[null,{"$f":"IF('Test Score Input'!#REF!=\"\",\"x\",'Test Score Input'!#REF!&\" (score= \"&D123&\")\")","v":{"$error":"#REF!"}},{"$f":"IF('Test Score Input'!G30=\"\",40,'Test Score Input'!G30)","v":100},{"$f":"IF('Test Score Input'!E30=\"\",\"\",'Test Score Input'!E30)","v":100}]
[null,{"$f":"IF('Test Score Input'!C31=\"\",\"x\",'Test Score Input'!C31&\" (score= \"&D124&\")\")","v":"x"},{"$f":"IF('Test Score Input'!G31=\"\",40,'Test Score Input'!G31)","v":0},{"$f":"IF('Test Score Input'!E31=\"\",\"\",'Test Score Input'!E31)","v":""}]
[null,{"$f":"IF('Test Score Input'!C30=\"\",\"x\",'Test Score Input'!C30&\" (score= \"&D125&\")\")","v":"Reynold Depression (score= 45)"},{"$f":"IF('Test Score Input'!G32=\"\",40,'Test Score Input'!G32)","v":93},{"$f":"IF('Test Score Input'!E32=\"\",\"\",'Test Score Input'!E32)","v":45}]
[null,{"$f":"IF('Test Score Input'!C33=\"\",\"x\",'Test Score Input'!C33&\" (score= \"&D126&\")\")","v":"x"},{"$f":"IF('Test Score Input'!G33=\"\",40,'Test Score Input'!G33)","v":0},{"$f":"IF('Test Score Input'!E33=\"\",\"\",'Test Score Input'!E33)","v":""}]
[null,{"$f":"IF('Test Score Input'!C32=\"\",\"x\",'Test Score Input'!C32&\" (score= \"&D127&\")\")","v":"MASC (score= )"},{"$f":"IF('Test Score Input'!G34=\"\",40,'Test Score Input'!G34)","v":0},{"$f":"IF('Test Score Input'!E34=\"\",\"\",'Test Score Input'!E34)","v":""}]
[null,{"$f":"IF('Test Score Input'!#REF!=\"\",\"x\",'Test Score Input'!#REF!&\" (score= \"&D128&\")\")","v":{"$error":"#REF!"}},{"$f":"IF('Test Score Input'!G35=\"\",40,'Test Score Input'!G35)","v":112},{"$f":"IF('Test Score Input'!E35=\"\",\"\",'Test Score Input'!E35)","v":58}]
[null,{"$f":"IF('Test Score Input'!C34=\"\",\"x\",'Test Score Input'!C34&\" (score= \"&D129&\")\")","v":"CBCL (score= 62)"},{"$f":"IF('Test Score Input'!G36=\"\",40,'Test Score Input'!G36)","v":118},{"$f":"IF('Test Score Input'!E36=\"\",\"\",'Test Score Input'!E36)","v":62}]
[null,{"$f":"IF('Test Score Input'!C35=\"\",\"x\",'Test Score Input'!C35&\" (score= \"&D130&\")\")","v":"Total (score= 54)"},{"$f":"IF('Test Score Input'!G37=\"\",40,'Test Score Input'!G37)","v":106},{"$f":"IF('Test Score Input'!E37=\"\",\"\",'Test Score Input'!E37)","v":54}]
[null,{"$f":"IF('Test Score Input'!C36=\"\",\"x\",'Test Score Input'!C36&\" (score= \"&D131&\")\")","v":"Anxious (score= 53)"},{"$f":"IF('Test Score Input'!G38=\"\",40,'Test Score Input'!G38)","v":105},{"$f":"IF('Test Score Input'!E38=\"\",\"\",'Test Score Input'!E38)","v":53}]
[null,{"$f":"IF('Test Score Input'!C38=\"\",\"x\",'Test Score Input'!C38&\" (score= \"&D132&\")\")","v":"Somatic (score= 62)"},{"$f":"IF('Test Score Input'!G39=\"\",40,'Test Score Input'!G39)","v":118},{"$f":"IF('Test Score Input'!E39=\"\",\"\",'Test Score Input'!E39)","v":62}]
[null,{"$f":"IF('Test Score Input'!C40=\"\",\"x\",'Test Score Input'!C40&\" (score= \"&D133&\")\")","v":"Thought (score= 64)"},{"$f":"IF('Test Score Input'!G40=\"\",40,'Test Score Input'!G40)","v":121},{"$f":"IF('Test Score Input'!E40=\"\",\"\",'Test Score Input'!E40)","v":64}]
[null,{"$f":"IF('Test Score Input'!C41=\"\",\"x\",'Test Score Input'!C41&\" (score= \"&D134&\")\")","v":"Attention (score= 51)"},{"$f":"IF('Test Score Input'!G41=\"\",40,'Test Score Input'!G41)","v":102},{"$f":"IF('Test Score Input'!E41=\"\",\"\",'Test Score Input'!E41)","v":51}]
[null,{"$f":"IF('Test Score Input'!#REF!=\"\",\"x\",'Test Score Input'!#REF!&\" (score= \"&D135&\")\")","v":{"$error":"#REF!"}},{"$f":"IF('Test Score Input'!G42=\"\",40,'Test Score Input'!G42)","v":105},{"$f":"IF('Test Score Input'!E42=\"\",\"\",'Test Score Input'!E42)","v":53}]
[null,{"$f":"IF('Test Score Input'!#REF!=\"\",\"x\",'Test Score Input'!#REF!&\" (score= \"&D136&\")\")","v":{"$error":"#REF!"}},{"$f":"IF('Test Score Input'!G43=\"\",40,'Test Score Input'!G43)","v":117},{"$f":"IF('Test Score Input'!E43=\"\",\"\",'Test Score Input'!E43)","v":61}]
[null,{"$f":"IF('Test Score Input'!C42=\"\",\"x\",'Test Score Input'!C42&\" (score= \"&D137&\")\")","v":"Rule (score= 65)"},{"$f":"IF('Test Score Input'!G44=\"\",40,'Test Score Input'!G44)","v":123},{"$f":"IF('Test Score Input'!E44=\"\",\"\",'Test Score Input'!E44)","v":65}]
[null,{"$f":"IF('Test Score Input'!C43=\"\",\"x\",'Test Score Input'!C43&\" (score= \"&D138&\")\")","v":"Aggressive (score= )"},{"$f":"IF('Test Score Input'!G45=\"\",40,'Test Score Input'!G45)","v":0},{"$f":"IF('Test Score Input'!E45=\"\",\"\",'Test Score Input'!E45)","v":""}]
[null,{"$f":"IF('Test Score Input'!D46=\"\",\"x\",'Test Score Input'!D46&\" (score= \"&D139&\")\")","v":"x"},{"$f":"IF('Test Score Input'!G46=\"\",40,'Test Score Input'!G46)","v":40},{"$f":"IF('Test Score Input'!E46=\"\",\"\",'Test Score Input'!E46)","v":""}]
[null,{"$f":"IF('Test Score Input'!D47=\"\",\"x\",'Test Score Input'!D47&\" (score= \"&D140&\")\")","v":"x"},{"$f":"IF('Test Score Input'!G47=\"\",40,'Test Score Input'!G47)","v":40},{"$f":"IF('Test Score Input'!E47=\"\",\"\",'Test Score Input'!E47)","v":""}]
[null,{"$f":"IF('Test Score Input'!D48=\"\",\"x\",'Test Score Input'!D48&\" (score= \"&D141&\")\")","v":"x"},{"$f":"IF('Test Score Input'!G48=\"\",40,'Test Score Input'!G48)","v":40},{"$f":"IF('Test Score Input'!E48=\"\",\"\",'Test Score Input'!E48)","v":""}]
[]
[]
[]
[]
[]
[]
[1,3,9,22,50,68,76,68,50,22,9,3,1]