{"text_format":"1","workbook":"xlsx","n_sheets":6,"sheets":["Warning","SB V Scores","Composite Graph","Subtest Graph","SB V vs WJ III Ach","SB V-WJ III Ach Graph"],"not_rendered":{"charts":3,"images":0,"macros":1,"external_links":0,"defined_names":18,"comments":0,"pivot_tables":0},"unopened":[],"bounds":{"document_bytes":16777216,"sheet_cells":100000,"rows_first":2000,"rows_last":500,"rows_between":2000,"halvings":0,"cell_chars":16384,"cell_head_chars":4096},"cells_cut":0,"cells_raw":0,"read":"whole","date_system":"1900"}

{"sheet":"Warning","index":0,"n_rows":18,"n_cols":1,"rows_kept":18,"cut":false,"hidden":false,"merged":[]}
["These template sheets come with some scores already entered into cells. These scores act as placeholders and demonstrate what scores are necessary."]
[]
[]
[]
["Be sure to delete any scores that do not pertain to your particular case."]
[]
["We (Ron Dumont and John Willis), take no responsibility for any errors made while using these templates."]
[]
["The template does not calculate subtest or composite (IQ and Index) scores.  The examiner must use"]
["the SB 5 Manual to obtain these scores."]
[]
["The template does not incorporate either the Abbreviated Battery or the Change Score analysis."]
[]
["The Percentiles reported in the template are based upon a normal curve table and may not reflect the"]
["exact percentile reported in the SB 5 manual."]
[]
["The Confidence intervals are based upon a formula provided in the SB 5 manual and therefore"]
["do not always match the intervals provided by the SB 5 manual tables."]

{"sheet":"SB V Scores","index":1,"n_rows":314,"n_cols":182,"rows_kept":314,"cut":false,"hidden":false,"merged":[[79,3,79,4],[54,8,54,9],[66,1,66,11],[5,7,5,8],[135,3,135,10],[120,3,120,5],[120,7,120,10],[121,7,121,8],[2,1,2,11],[57,1,57,11],[97,4,97,7],[83,1,83,11],[74,3,74,4],[75,3,75,4],[48,1,48,11],[40,9,40,12],[41,9,41,12],[43,6,43,7],[12,7,12,10],[7,8,7,10],[9,8,10,10],[7,7,10,7],[37,9,37,12],[36,9,36,12],[41,6,41,7],[38,9,38,12],[5,5,5,6],[5,9,5,11],[44,6,44,7],[42,6,42,7],[50,6,50,7],[19,20,19,24],[23,9,25,9],[19,15,19,19],[38,6,38,7],[36,6,36,7],[37,6,37,7],[40,6,40,7],[5,2,5,3],[19,9,21,9],[28,1,29,2],[11,7,11,10],[53,6,53,7],[53,8,53,9],[51,10,53,11],[42,9,42,12],[43,9,43,12],[44,9,44,12],[128,1,129,1],[104,3,104,6],[88,3,88,7],[98,3,99,3],[0,1,0,11],[1,1,1,11],[35,8,35,11],[3,10,3,11],[35,6,35,7],[3,2,3,3],[80,3,80,4],[119,7,119,8],[63,6,63,9],[54,2,54,3],[60,6,60,7],[54,6,54,7],[62,6,62,9],[97,9,104,9],[72,1,72,6],[77,1,77,6]]}
[null,"Stanford Binet Intelligence Scales Fifth Edition, Gale H. Roid © Riverside Publishing, 2003. All Rights Reserved"]
[null,"Dumont-Willis SB5 Interpretive Worksheet"]
[null,"Use the TAB key to navigate to cells requiring input",null,null,null,null,null,null,null,null,null,null,null,null,null,null,null,null,null,null,{"$f":"D12","v":2003},{"$f":"E12","v":7},{"$f":"F12","v":29},{"$f":"IF(Y4>Z3,U3-1,U3)","v":2003},{"$f":"IF(Y4>Z3,Z3+12,Z3)","v":7},{"$f":"IF(AA4>W3,V3-1,V3)","v":7},{"$f":"IF(AA4>W3,W3+30,W3)","v":29}]
[null,"Name: ","Andre B",null,null,null,null,null,null,"Date Analyzed: ",{"$f":"NOW()","v":"2014-02-11T13:45:29.780"},null,null,null,null,3,null,null,null,null,null,null,null,{"$f":"D13","v":1995},{"$f":"E13","v":5},null,{"$f":"F13","v":16}]
[null,null,null,null,null,null,null,null,null,null,null,null,null,null,null,null,null,null,null,null,null,null,null,{"$f":"X3-X4","v":8},{"$f":"Y3-Y4","v":2},null,{"$f":"AA3-AA4","v":13},null,{"$f":"X5&\" years, \"&Y5&Y6&AA5&AA6","v":"8 years, 2 months13 days"}]
[null,"ID #:","",null,"Examiner:","RPD",null,"School/Agency:",null,null,null,null,null,null,null,null,null,null,null,{"$f":"FIND(\" \",C4)","v":6},{"$f":"MID(C4,1,T6-1)","v":"Andre"},null,null,null,{"$f":"IF(Y5=1,\" month\",\" months\")","v":" months"},null,{"$f":"IF(AA5=1,\" day\",\" days\")","v":" days"}]
[null,null,null,null,null,null,null,null,null,null,null,null,null,null,null,null,null,null,null,null,null,null,1,2," ",4,5,6,7,8,9,10,11,12,13]
[null,null,null,null,null,null,null,"B","Stanford",null,null,null,null,null,null,null,null,null,null,null,null,null,16,18,20,25,30,35,45,55,65,70,75,80,85]
[]
[null,null,null,null,null,null,null,null,"INET"]
[null,null,null,"Year","Month","Day"]
[null,null,"Date of Test:",2003,7,29,null,"Intelligence Scale"]
[null,null,"Date of Birth:",1995,5,16,null,"Fifth Edition"]
[null,null,"Age:   ",{"$f":"X5&\" years\"","v":"8 years"},{"$f":"Y5&Y6","v":"2 months"},{"$f":"AA5&AA6","v":"13 days"}]
[]
[]
[]
[]
[null,"1. Enter obtained Scaled Scores:"]
[null,"Nonverbal (NV) Domain",null,null,null,null,null,null,null,"Nonverbal Sum of Scaled Scores",null,null,null,null,null,"Nonverbal (NV)",null,null,null,null,"Verbal (V)"]
[null,null,null,"FR","KN","QR","VS","WM",null,null,null,null,null,null,null,"FR","KN","QR","VS","WM","FR","KN","QR","VS","WM"]
[null,null,"NV Scaled Score",4,10,10,8,4,null,null,"=",{"$f":"SUM(D22:H22)","v":36},null,null,null,{"$f":"D22","v":4},{"$f":"E22","v":10},{"$f":"F22","v":10},{"$f":"G22","v":8},{"$f":"H22","v":4},{"$f":"D26","v":8},{"$f":"E26","v":8},{"$f":"F26","v":7},{"$f":"G26","v":10},{"$f":"H26","v":13}]
[]
[null,"Verbal (V) Domain",null,null,null,null,null,null,null,"Verbal Sum of Scaled Scores",null,null,null,null,null,{"$f":"IF(COUNT(D22:H22)<5,\"\",L22/5)","v":7.2},{"$f":"COUNT(D22:H22)","v":5}]
[null,null,null,"FR","KN","QR","VS","WM",null,null,null,null,null,null,null,null,null,null,null,"nvmax","nvmin","nvscat","vmax","vmin","vsct",null,null,null,null,null,null,null,null,null,null,null,null,null,null,null,null,null,null,null,null,null,null,null,null,null,null,null,null,null,null,null,null,null,null,null,null,null,null,null,null,null,null,null,null,null,null,null,null,null,null,null,null,null,null,null,null,null,null,null,null,null,1]
[null,null,"V Scaled Score",8,8,7,10,13,null,null,"=",{"$f":"SUM(D26:H26)","v":46},null,null,{"$f":"IF(CI25=1,90,95)","v":90},{"$f":"IF(COUNT(D26:H26)<5,\"\",L26/5)","v":9.1999999999999993},{"$f":"COUNT(D26:H26)","v":5},null,null,{"$f":"MAX(P22:T22)","v":10},{"$f":"MIN(P22:T22)","v":4},{"$f":"ABS(T26-U26)","v":6},{"$f":"MAX(U22:Y22)","v":13},{"$f":"MIN(U22:Y22)","v":7},{"$f":"ABS(W26-X26)","v":6}]
[null,null,null,null,null,null,null,null,null,null,null,null,null,null,null,null,{"$f":"Q26+Q24","v":10}]
[]
[null,"Sum of NV and V Scaled Scores",null,"FR","KN","QR","VS","WM"]
[null,null,null,{"$f":"D22+D26","v":12},{"$f":"E22+E26","v":18},{"$f":"F22+F26","v":17},{"$f":"G22+G26","v":18},{"$f":"H22+H26","v":17},null,null,null,null,null,null,null,{"$f":"IF(Q27<10,\"\",SUM(D30:H30)/10)","v":8.1999999999999993}]
[null,null,null,null,null,null,null,null,null,null,null,null,null,null,null,{"$f":"IF(COUNT(D31:H31)<5,\"\",L31/5)","v":""}]
[]
[null,"2. Enter obtained Standard Scores:"]
[]
[]
[null,null,null,"Sum of Scaled Scores","Standard Score","Percentile Rank",{"$f":"O26&\"% Confidence Interval\"","v":"90% Confidence Interval"},null,"Label"]
[null,null,"Nonverbal IQ",{"$f":"L22","v":36},82,{"$f":"IF(E37=\"\",\"\",LOOKUP(E37,B271:BG272))","v":12},{"$f":"IF(E37=\"\",\"\",S37&\" - \"&T37)","v":"78 - 88"},null,null,{"$f":"IF(E37=\"\",\"\",LOOKUP(S37,IQClass)&\" to \"&LOOKUP(T37,IQClass))","v":"Borderline Impaired to Low Average"},null,null,null,null,0.95,{"$f":"100+O37*(nviq-100)","v":82.9},{"$f":"15*SQRT((1-O37)*(O37))","v":3.2691742076555066},{"$f":"IF($O$26=90,Q37*1.65,Q37*1.96)","v":5.3941374426315853},{"$f":"ROUND(P37-R37,0)","v":78},{"$f":"ROUND(P37+R37,0)","v":88}]
[null,null,"Verbal IQ",{"$f":"L26","v":46},95,{"$f":"IF(E38=\"\",\"\",LOOKUP(E38,B271:BG272))","v":37},{"$f":"IF(E38=\"\",\"\",S38&\" - \"&T38)","v":"90 - 100"},null,null,{"$f":"IF(E38=\"\",\"\",LOOKUP(S38,IQClass)&\" to \"&LOOKUP(T38,IQClass))","v":"Average to Average"},null,null,null,null,0.96,{"$f":"100+O38*(viq-100)","v":95.2},{"$f":"15*SQRT((1-O38)*(O38))","v":2.9393876913398151},{"$f":"IF($O$26=90,Q38*1.65,Q38*1.96)","v":4.8499896907106947},{"$f":"ROUND(P38-R38,0)","v":90},{"$f":"ROUND(P38+R38,0)","v":100}]
[null,null,"Full Scale IQ",{"$f":"D37+D38","v":82},88,{"$f":"IF(E39=\"\",\"\",LOOKUP(E39,B271:BG272))","v":21},{"$f":"IF(E39=\"\",\"\",S39&\" - \"&T39)","v":"85 - 92"},null,null,{"$f":"IF(E39=\"\",\"\",LOOKUP(S39,IQClass)&\" to \"&LOOKUP(T39,IQClass))","v":"Low Average to Average"},null,null,null,null,0.98,{"$f":"100+O39*(fsiq-100)","v":88.24},2.100000000000001,3.4650000000000016,85,92]
[]
[null,null,"Fluid Reasoning",{"$f":"D30","v":12},76,{"$f":"IF(E41=\"\",\"\",LOOKUP(E41,B271:BG272))","v":5},{"$f":"IF(E41=\"\",\"\",S41&\" - \"&T41)","v":"71 - 86"},null,null,{"$f":"IF(E41=\"\",\"\",LOOKUP(S41,IQClass)&\" to \"&LOOKUP(T41,IQClass))","v":"Borderline Impaired to Low Average"},null,null,null,null,0.9,{"$f":"100+O41*(E41-100)","v":78.400000000000006},4.5,7.4249999999999998,71,86]
[null,null,"Knowledge",{"$f":"E30","v":18},94,{"$f":"IF(E42=\"\",\"\",LOOKUP(E42,B271:BG272))","v":34},{"$f":"IF(E42=\"\",\"\",S42&\" - \"&T42)","v":"88 - 101"},null,null,{"$f":"IF(E42=\"\",\"\",LOOKUP(S42,IQClass)&\" to \"&LOOKUP(T42,IQClass))","v":"Low Average to Average"},null,null,null,null,0.92,{"$f":"100+O42*(E42-100)","v":94.48},4.06939798987516,6.7145066832940135,88,101]
[null,null,"Quantitative Reasoning",{"$f":"F30","v":17},92,{"$f":"IF(E43=\"\",\"\",LOOKUP(E43,B271:BG272))","v":30},{"$f":"IF(E43=\"\",\"\",S43&\" - \"&T43)","v":"86 - 99"},null,null,{"$f":"IF(E43=\"\",\"\",LOOKUP(S43,IQClass)&\" to \"&LOOKUP(T43,IQClass))","v":"Low Average to Average"},null,null,null,null,0.92,{"$f":"100+O43*(E43-100)","v":92.64},4.06939798987516,6.7145066832940135,86,99]
[null,null,"Visual-Spatial Processing",{"$f":"G30","v":18},94,{"$f":"IF(E44=\"\",\"\",LOOKUP(E44,B271:BG272))","v":34},{"$f":"IF(E44=\"\",\"\",S44&\" - \"&T44)","v":"88 - 101"},null,null,{"$f":"IF(E44=\"\",\"\",LOOKUP(S44,IQClass)&\" to \"&LOOKUP(T44,IQClass))","v":"Low Average to Average"},null,null,null,null,0.92,{"$f":"100+O44*(E44-100)","v":94.48},4.06939798987516,6.7145066832940135,88,101]
[null,null,"Working Memory",{"$f":"H30","v":17},91,{"$f":"IF(E45=\"\",\"\",LOOKUP(E45,B271:BG272))","v":27},{"$f":"IF(E45=\"\",\"\",S45&\" - \"&T45)","v":"85 - 99"},null,null,{"$f":"IF(E45=\"\",\"\",LOOKUP(S45,IQClass)&\" to \"&LOOKUP(T45,IQClass))","v":"Low Average to Average"},null,null,null,null,0.91,{"$f":"100+O45*(E45-100)","v":91.81},4.2927264063762545,7.0829985705208198,85,99]
[]
[]
[]
[null,"SB V Interpretive Worksheet",null,null,null,null,null,null,null,null,null,null,null,null,"Nonverbal IQ","Verbal IQ","Full Scale IQ","Fluid Reasoning","Knowledge","Quantitative Reasoning","Visual-Spatial Processing","Working Memory"]
[null,null,null,null,null,null,null,null,null,null,null,null,null,null,{"$f":"E37","v":82},{"$f":"E38","v":95},{"$f":"E39","v":88},{"$f":"E41","v":76},{"$f":"E42","v":94},{"$f":"E43","v":92},{"$f":"E44","v":94},{"$f":"E45","v":91}]
[null,"3. Is the NVIQ versus VIQ significantly different?",null,null,null,null,{"$f":"IF(OR(nviq=\"\",viq=\"\"),\"\",IF(E55>11, \"YES, p = .01\", IF(E55<9, \"NO\",\"YES, p = .05\")))","v":"YES, p = .01"}]
[]
[null,null,null,null,null,null,null,"Significance"]
[null,null,null,null,"Diff","(p <  .01)","(p < .05)",null,"Normal"]
[null,null,{"$f":"\"NVIQ = \"&nviq&\"    VIQ = \"&viq","v":"NVIQ = 82    VIQ = 95"},null,{"$f":"IF(OR(nviq=\"\",viq=\"\"),\"\",ABS(nviq-viq))","v":13},"12 or more","10 - 11",null,"0 - 8"]
[]
[]
[null,{"$f":"IF(T129=0,V129,V130)","v":"Because there is a significant difference between the NVIQ and VIQ, examine possible reasons."}]
[]
[]
[null,"4. Is the NVIQ versus VIQ difference abnormally large?",null,null,null,null,{"$f":"IF(E64=\"\",\"\",IF(E64<G64,\"NO\",\"YES\"))","v":"YES"}]
[]
[null,null,null,null,"Diff",null,"Size of Difference needed for abnormality"]
[null,null,{"$f":"\"NVIQ (\"&nviq&\")     VIQ (\"&viq&\")\"","v":"NVIQ (82)     VIQ (95)"},null,{"$f":"E55","v":13},null,13]
[]
[]
[null,{"$f":"IF(T138=0,V138,V139)","v":"Because an abnormal difference was found, explain the abnormally large NV vs. V difference."}]
[]
[]
[]
[null,"5. Is there an abnormal amount of NVIQ or VIQ scatter?"]
[]
[null,"        A. Is there abnormal Nonverbal scatter?",null,null,null,null,null,{"$f":"IF(F76>8,\"YES\",\"NO\")","v":"NO"}]
[]
[null,null,null,"Difference",null,"Scatter","Abnormal","Normal"]
[null,null,null,{"$f":"\"High (\"&T26&\") - Low (\"&U26&\")\"","v":"High (10) - Low (4)"},null,{"$f":"V26","v":6},"9 or more","0 - 8"]
[]
[null,"  B. Is there abnormal Verbal scatter?",null,null,null,null,null,{"$f":"IF(F81>7,\"YES\",\"NO\")","v":"NO"}]
[]
[null,null,null,"Difference",null,"Scatter","Abnormal","Normal"]
[null,null,null,{"$f":"\"High (\"&W26&\") - Low (\"&X26&\")\"","v":"High (13) - Low (7)"},null,{"$f":"Y26","v":6},"8 or more","0 - 7"]
[]
[]
[null,{"$f":"IF(Q154=0,R154,R155)","v":"Because each answer to A and B was NO, the NVIQ versus VIQ discrepancy is interpretable."}]
[]
[]
[null,"6. Are the Factor index scores discrepant from each other?",null,null,null,null,null,{"$f":"IF(S109>0,\"YES\",\"NO\")","v":"YES"}]
[]
[null,null,null,"Differences between indexes"]
[null,null,null,"Fluid Reasoning","Knowledge","Quantitative Reasoning","Visual-Spatial Processing","Working Memory"]
[null,null,"Index score=",{"$f":"E41","v":76},{"$f":"E42","v":94},{"$f":"E43","v":92},{"$f":"E44","v":94},{"$f":"E45","v":91}]
[null,null,"Fluid Reasoning",null,{"$f":"D93","v":18},{"$f":"D94","v":16},{"$f":"D95","v":18},{"$f":"D96","v":15}]
[null,null,"Knowledge",{"$f":"ABS(D91-E91)","v":18},null,{"$f":"E94","v":2},{"$f":"E95","v":0},{"$f":"E96","v":3}]
[null,null,"Quantitative Reasoning",{"$f":"ABS(D91-F91)","v":16},{"$f":"ABS(E91-F91)","v":2},null,{"$f":"F95","v":2},{"$f":"F96","v":1}]
[null,null,"Visual-Spatial Processing",{"$f":"ABS(D91-G91)","v":18},{"$f":"ABS(E91-G91)","v":0},{"$f":"ABS(F91-G91)","v":2},null,{"$f":"G96","v":3}]
[null,null,"Working Memory",{"$f":"ABS(D91-H91)","v":15},{"$f":"ABS(E91-H91)","v":3},{"$f":"ABS(F91-H91)","v":1},{"$f":"ABS(G91-H91)","v":3}]
[null,null,null,null,null,null,null,null,null,null,null,null,null,null,"Fluid Reasoning","Knowledge","Quantitative Reasoning","Visual-Spatial Processing","Working Memory",null,"Fluid Reasoning","Knowledge","Quantitative Reasoning","Visual-Spatial Processing","Working Memory"]
[null,null,null,null,"Abnormality (abn)",null,null,null,null,"Compare Significance with Abnormality"]
[null,null,null,"Fluid Reasoning","Knowledge","Quantitative Reasoning","Visual-Spatial Processing","Working Memory",null,null,null,null,null,null,null,21,20,20,21,null,null,21,20,20,21]
[null,null,null,null,{"$f":"IF(ABS(E92)>P99,\"abn\",\"\")","v":""},{"$f":"IF(ABS(F92)>Q99,\"abn\",\"\")","v":""},{"$f":"IF(ABS(G92)>R99,\"abn\",\"\")","v":""},{"$f":"IF(ABS(H92)>S99,\"abn\",\"\")","v":""},null,null,null,null,null,null,12.8,null,20,20,20,null,{"$f":"IF($O$26=90,O100,(O100/1.65)*1.96)","v":12.8},null,20,20,20]
[null,null,"Knowledge",{"$f":"IF(ABS(D93)>O100,\"sgn\",\"\")","v":"sgn"},null,{"$f":"IF(ABS(F93)>Q100,\"abn\",\"\")","v":""},{"$f":"IF(ABS(G93)>R100,\"abn\",\"\")","v":""},{"$f":"IF(ABS(H93)>S100,\"abn\",\"\")","v":""},null,null,null,null,null,null,12.7,12,null,18,19,null,12.7,12,null,18,19]
[null,null,"Quantitative Reasoning",{"$f":"IF(ABS(D94)>O101,\"sgn\",\"\")","v":"sgn"},{"$f":"IF(ABS(E94)>P101,\"sgn\",\"\")","v":""},null,{"$f":"IF(ABS(G94)>R101,\"abn\",\"\")","v":""},{"$f":"IF(ABS(H94)>S101,\"abn\",\"\")","v":""},null,null,null,null,null,null,12.8,12.2,12.1,null,19,null,12.8,12.2,12.1,null,19]
[null,null,"Visual-Spatial Processing",{"$f":"IF(ABS(D95)>O102,\"sgn\",\"\")","v":"sgn"},{"$f":"IF(ABS(E95)>P102,\"sgn\",\"\")","v":""},{"$f":"IF(ABS(F95)>Q102,\"sgn\",\"\")","v":""},null,null,null,null,null,null,null,null,13.1,12.5,12.4,12.5,null,null,13.1,12.5,12.4,12.5]
[null,null,"Working Memory",{"$f":"IF(ABS(D96)>O103,\"sgn\",\"\")","v":"sgn"},{"$f":"IF(ABS(E96)>P103,\"sgn\",\"\")","v":""},{"$f":"IF(ABS(F96)>Q103,\"sgn\",\"\")","v":""},{"$f":"IF(ABS(G96)>R103,\"sgn\",\"\")","v":""},null,null,null,null,null,null,null,{"$f":"IF(ABS(D93)>O100,1,\"\")","v":1},null,{"$f":"IF(ABS(Q96)>AB103,\"*\",\"\")","v":""},{"$f":"IF(ABS(R96)>AC103,\"*\",\"\")","v":""}]
[null,null,null,".05 Significance (sgn)",null,null,null,null,null,null,null,null,null,null,{"$f":"IF(ABS(D94)>O101,1,\"\")","v":1},{"$f":"IF(ABS(E94)>P101,1,\"\")","v":""},null,{"$f":"IF(ABS(R97)>AC104,\"*\",\"\")","v":{"$error":"#VALUE!"}}]
[null,null,null,null,null,null,null,null,null,null,null,null,null,null,{"$f":"IF(ABS(D95)>O102,1,\"\")","v":1},{"$f":"IF(ABS(E95)>P102,1,\"\")","v":""},{"$f":"IF(ABS(F95)>Q102,1,\"\")","v":""}]
[null,"7. Are there significant differences between the Nonverbal and Verbal domains?",null,null,null,null,null,null,null,{"$f":"IF(O187>0,\"YES\",\"NO\")","v":"YES"},null,null,null,null,{"$f":"IF(ABS(D96)>O103,1,\"\")","v":1},{"$f":"IF(ABS(E96)>P103,1,\"\")","v":""},{"$f":"IF(ABS(F96)>Q103,1,\"\")","v":""},{"$f":"IF(ABS(R99)>AC106,1,\"\")","v":1}]
[]
[null,null,null,"Nonverbal","Verbal","Difference","Significance",null,null,null,null,null,null,null,{"$f":"SUM(O104:O108)","v":4},{"$f":"SUM(P105:P108)","v":0},{"$f":"SUM(Q106:Q108)","v":0},{"$f":"SUM(R107:R108)","v":1},{"$f":"SUM(O109:R109)","v":5}]
[null,null,"Fluid Reasoning",{"$f":"D123","v":4},{"$f":"D131","v":8},{"$f":"ABS(D110-E110)","v":4},{"$f":"P182","v":"NS"},""]
[null,null,"Knowledge",{"$f":"D124","v":10},{"$f":"D132","v":8},{"$f":"ABS(D111-E111)","v":2},"NS",""]
[null,null,"Quantitative Reasoning",{"$f":"D125","v":10},{"$f":"D133","v":7},{"$f":"ABS(D112-E112)","v":3},"NS",""]
[null,null,"Visual-Spatial Processing",{"$f":"D126","v":8},{"$f":"D134","v":10},{"$f":"ABS(D113-E113)","v":2},"NS",""]
[null,null,"Working Memory",{"$f":"D127","v":4},{"$f":"D135","v":13},{"$f":"ABS(D114-E114)","v":9},"*","Verbal WM greater than Nonverbal WM"]
[]
[null,"8. Are there significant subtest strengths and weaknesses?"]
[]
[]
[]
[null,null,null,null,null,null,null," Full Scale",null,{"$f":"\"(x = \"&P121&\")\"","v":"(x = 8.2)"},null,null,null,null,{"$f":"P24","v":7.2}]
[null,null,null," Nonverbal and Verbal Statistics",null,null,null,"Full Scale Statistics",null,null,null,null,null,null,{"$f":"P26","v":9.1999999999999993},{"$f":"P30","v":8.1999999999999993}]
[null,"Nonverbal",{"$f":"\"(X = \"&P24&\")\"","v":"(X = 7.2)"},"SS","Crit. Value","Deviation",null,"Crit. Value",null,"Deviation"]
[null,null,"Fluid Reasoning",{"$f":"IF(D22=\"\",\"\",D22)","v":4},2.7,{"$f":"IF(D123=\"\",\"\",(D123-$O$120))","v":-3.2},{"$f":"IF(D123=\"\",\"\",IF(F123>E123,\"s\",IF(F123<-E123,\"w\",\" \")))","v":"w"},3.13,null,{"$f":"IF(D123=\"\",\"\",(D123-$P$121))","v":-4.1999999999999993},{"$f":"IF(D123=\"\",\"\",IF(J123>H123,\"s\",IF(J123<-H123,\"w\",\" \")))","v":"w"}]
[null,null,"Knowledge",{"$f":"IF(E22=\"\",\"\",E22)","v":10},2.7,{"$f":"IF(D124=\"\",\"\",(D124-$O$120))","v":2.8},{"$f":"IF(D124=\"\",\"\",IF(F124>E124,\"s\",IF(F124<-E124,\"w\",\" \")))","v":"s"},3.13,null,{"$f":"IF(D124=\"\",\"\",(D124-$P$121))","v":1.8000000000000007},{"$f":"IF(D124=\"\",\"\",IF(J124>H124,\"s\",IF(J124<-H124,\"w\",\" \")))","v":" "}]
[null,null,"Quantitative Reasoning",{"$f":"IF(F22=\"\",\"\",F22)","v":10},2.63,{"$f":"IF(D125=\"\",\"\",(D125-$O$120))","v":2.8},{"$f":"IF(D125=\"\",\"\",IF(F125>E125,\"s\",IF(F125<-E125,\"w\",\" \")))","v":"s"},3.04,null,{"$f":"IF(D125=\"\",\"\",(D125-$P$121))","v":1.8000000000000007}," "]
[null,null,"Visual-Spatial Processing",{"$f":"IF(G22=\"\",\"\",G22)","v":8},2.6,{"$f":"IF(D126=\"\",\"\",(D126-$O$120))","v":0.79999999999999982},{"$f":"IF(D126=\"\",\"\",IF(F126>E126,\"s\",IF(F126<-E126,\"w\",\" \")))","v":" "},2.99,null,{"$f":"IF(D126=\"\",\"\",(D126-$P$121))","v":-0.19999999999999929}," "]
[null,null,"Working Memory",{"$f":"IF(H22=\"\",\"\",H22)","v":4},2.5099999999999998,{"$f":"IF(D127=\"\",\"\",(D127-$O$120))","v":-3.2},{"$f":"IF(D127=\"\",\"\",IF(F127>E127,\"s\",IF(F127<-E127,\"w\",\" \")))","v":"w"},2.87,null,{"$f":"IF(D127=\"\",\"\",(D127-$P$121))","v":-4.1999999999999993},"w"]
[]
[null,"Verbal",null,null,null,null,null,null,null,{"$f":"IF(D129=\"\",\"\",(D129-$P$121))","v":""},null,null,null,null,null,null,null,null,null,{"$f":"IF(G51=\"NO\",0,1)","v":1},null,"Because there is no significant differences between the NVIQ and VIQ, explain the meaning of the scales not being significantly different."]
[null,null,{"$f":"\"(X = \"&P26&\")\"","v":"(X = 9.2)"},null,null,null,null,null,null,"",null,null,null,null,null,null,null,null,null,null,null,"Because there is a significant difference between the NVIQ and VIQ, examine possible reasons."]
[null,null,"Fluid Reasoning",{"$f":"IF(D26=\"\",\"\",D26)","v":8},2.69,{"$f":"IF(D131=\"\",\"\",(D131-$O$121))","v":-1.1999999999999993},{"$f":"IF(D131=\"\",\"\",IF(F131>E131,\"s\",IF(F131<-E131,\"w\",\" \")))","v":" "},3.13,null,-0.19999999999999929,{"$f":"IF(D131=\"\",\"\",IF(J131>H131,\"s\",IF(J131<-H131,\"w\",\" \")))","v":" "}]
[null,null,"Knowledge",{"$f":"IF(E26=\"\",\"\",E26)","v":8},2.39,{"$f":"IF(D132=\"\",\"\",(D132-$O$121))","v":-1.1999999999999993},{"$f":"IF(D132=\"\",\"\",IF(F132>E132,\"s\",IF(F132<-E132,\"w\",\" \")))","v":" "},2.73,null,-0.19999999999999929," "]
[null,null,"Quantitative Reasoning",{"$f":"IF(F26=\"\",\"\",F26)","v":7},2.5299999999999998,{"$f":"IF(D133=\"\",\"\",(D133-$O$121))","v":-2.1999999999999993},{"$f":"IF(D133=\"\",\"\",IF(F133>E133,\"s\",IF(F133<-E133,\"w\",\" \")))","v":" "},2.92,null,-1.1999999999999993," "]
[null,null,"Visual-Spatial Processing",{"$f":"IF(G26=\"\",\"\",G26)","v":10},2.5,{"$f":"IF(D134=\"\",\"\",(D134-$O$121))","v":0.80000000000000071},{"$f":"IF(D134=\"\",\"\",IF(F134>E134,\"s\",IF(F134<-E134,\"w\",\" \")))","v":" "},2.87,null,1.8000000000000007," "]
[null,null,"Working Memory",{"$f":"IF(H26=\"\",\"\",H26)","v":13},2.76,{"$f":"IF(D135=\"\",\"\",(D135-$O$121))","v":3.8000000000000007},{"$f":"IF(D135=\"\",\"\",IF(F135>E135,\"s\",IF(F135<-E135,\"w\",\" \")))","v":"s"},3.23,null,4.8000000000000007,"s"]
[null,null,null,"Note: \"s\" = \"statistical strength\"        \"w\" = \"statsitical weakness\""]
[]
[null,null,null,null,null,null,null,null,null,null,null,null,null,null,null,null,null,null,null,{"$f":"IF(G61=\"NO\",0,1)","v":1},null,"Because no abnormal difference was found, determine if the noted differences are interpretable."]
[null,null,null,null,null,null,null,null,null,null,null,null,null,null,null,null,null,null,null,null,null,"Because an abnormal difference was found, explain the abnormally large NV vs. V difference."]
[]
[]
[]
[]
[]
[]
[]
[]
[]
[]
[]
[]
[]
[null,null,null,null,null,null,null,null,null,null,null,null,null,null,null,{"$f":"IF(H73=\"NO\",0,1)","v":0}]
[null,null,null,null,null,null,null,null,null,null,null,null,null,null,null,{"$f":"IF(H78=\"NO\",0,1)","v":0},{"$f":"P153+P154","v":0},"Because each answer to A and B was NO, the NVIQ versus VIQ discrepancy is interpretable."]
[null,null,null,null,null,null,null,null,null,null,null,null,null,null,null,null,null,"Because an answer to either A or B was YES, the NVIQ versus VIQ discrepancy differences should probably not be interpreted. "]
[]
[]
[]
[]
[]
[]
[]
[]
[]
[]
[]
[]
[]
[]
[]
[]
[]
[]
[]
[]
[]
[]
[]
[]
[]
[]
[null,null,null,null,null,null,null,null,null,null,null,null,null,null,{"$f":"IF(D110=\"\",\"\",IF(F110>4,1,\"\"))","v":""},{"$f":"IF(O182=1,\"*\",\"NS\")","v":"NS"},{"$f":"IF(O182=\"\",\"\",IF(D110>E110,\"Nonverbal FS greater than Verbal FS\",IF(E110>D110,\"Verbal FS greater than Nonverbal FS\",\"\")))","v":""}]
[null,null,null,null,null,null,null,null,null,null,null,null,null,null,{"$f":"IF(D111=\"\",\"\",IF(F111>4,1,\"\"))","v":""},{"$f":"IF(O183=1,\"*\",\"NS\")","v":"NS"},{"$f":"IF(O183=\"\",\"\",IF(D111>E111,\"Nonverbal KN greater than Verbal KN\",IF(E111>D111,\"Verbal KN greater than Nonverbal KN\",\"\")))","v":""}]
[null,null,null,null,null,null,null,null,null,null,null,null,null,null,{"$f":"IF(D112=\"\",\"\",IF(F112>4,1,\"\"))","v":""},{"$f":"IF(O184=1,\"*\",\"NS\")","v":"NS"},{"$f":"IF(O184=\"\",\"\",IF(D112>E112,\"Nonverbal QR greater than Verbal QR\",IF(E112>D112,\"Verbal QR greater than Nonverbal QR\",\"\")))","v":""}]
[null,null,null,null,null,null,null,null,null,null,null,null,null,null,{"$f":"IF(D113=\"\",\"\",IF(F113>4,1,\"\"))","v":""},{"$f":"IF(O185=1,\"*\",\"NS\")","v":"NS"},{"$f":"IF(O185=\"\",\"\",IF(D113>E113,\"Nonverbal VS greater than Verbal VS\",IF(E113>D113,\"Verbal VS greater than Nonverbal VS\",\"\")))","v":""}]
[null,null,null,null,null,null,null,null,null,null,null,null,null,null,{"$f":"IF(D114=\"\",\"\",IF(F114>4,1,\"\"))","v":1},{"$f":"IF(O186=1,\"*\",\"NS\")","v":"*"},{"$f":"IF(O186=\"\",\"\",IF(D114>E114,\"Nonverbal WM greater than Verbal WM\",IF(E114>D114,\"Verbal WM greater than Nonverbal WM\",\"\")))","v":"Verbal WM greater than Nonverbal WM"}]
[null,null,null,null,null,null,null,null,null,null,null,null,null,null,{"$f":"SUM(O182:O186)","v":1}]
[]
[]
[]
[]
[]
[]
[]
[]
[]
[]
[]
[]
[]
[]
[]
[]
[]
[]
[]
[]
[]
[]
[]
[]
[]
[]
[]
[]
[]
[]
[]
[]
[]
[]
[]
[]
[]
[]
[]
[]
[]
[]
[]
[]
[]
[]
[]
[]
[]
[]
[]
[]
[]
[]
[]
[]
[]
[]
[]
[]
[]
[]
[]
[]
[]
[]
[]
[]
[]
[]
[]
[]
[]
[]
[]
[]
[]
[]
[]
[]
[]
[]
[]
["SS",40,62,68,71,73,75,77,78,79,80,81,82,83,84,85,86,87,88,89,90,91,92,93,94,95,96,97,98,99,100,101,102,103,104,105,106,107,108,109,110,111,112,113,114,115,116,117,118,119,120,121,122,123,124,126,129,131,133]
["%ile",1,1,2,3,4,5,6,7,8,9,10,12,13,14,16,18,19,21,23,25,27,30,32,34,37,39,42,45,47,50,53,55,58,61,63,66,68,70,73,75,77,79,81,82,84,86,87,88,90,91,92,93,94,95,96,97,98,99]
[null,null,null,1,55,70,80,90,110,120,130,145]
[null,null,null,"Moderately Impaired","Mildly Impaired","Borderline Impaired","Low Average","Average","High Average","Superior","Gifted","Very Gifted"]
[null,null,"vsc",46,55,67,75,86,95,106,116,127,135,147,155]
[null,null,"vconf-",-4,-4,-5,-5,-6,-6,-7,-7,-8,-8,-9,-9]
[null,null,"vconf+",9,8,8,7,7,6,6,5,5,4,4,3]
[null,null,"psc",45,47,55,63,72,79,88,96,105,114,123,129,140,146,155]
[null,null,"pconf-",-3,-4,-4,-5,-5,-6,-6,-7,-7,-8,-8,-9,-9,-9,-9]
[null,null,"pconf+",10,10,9,9,8,8,7,7,6,6,5,5,4,4,3]
[null,null,"fssc",40,48,53,82,86,112,115,119,148,153]
[null,null,"fsconf-",-3,-3,-4,-4,-5,-5,-5,-6,-6,-7]
[null,null,"fsconf+",7,6,6,5,5,5,4,4,3,3]
[null,null,"psi",46,49,56,60,64,68,73,75,83,85,91,94,100,102,110,113,119,122,128,131,137,140,145,150]
[null,null,"psi",-3,-3,-4,-4,-5,-5,-6,-6,-7,-7,-8,-8,-9,-9,-10,-10,-11,-11,-12,-12,-13,-13,-14,-14]
[null,null,"psi",15,14,14,13,13,12,13,11,11,10,10,9,9,8,8,7,7,6,6,5,5,4,4,3]
[null,null,"GLC",45,50,54,63,67,75,78,86,91,100,103,113,116,125,128,138,141,147,152]
[null,null,"GLC",-3,-4,-4,-5,-5,-6,-6,-7,-7,-8,-8,-9,-9,-10,-10,-11,-11,-12,-12]
[null,null,"GLC",12,12,11,11,10,10,9,9,8,8,7,7,6,6,5,5,4,4,3]
[null,null,"wmi",50,55,63,73,80,88,97,106,113,124,130,139,147]
[null,null,"wmi-",-4,-4,-5,-5,-6,-6,-7,-7,-8,-8,-9,-9,-10]
[null,null,"wmi+",10,9,9,8,8,7,7,6,6,5,5,4,4]
[null,null,"pssc",54,57,63,71,73,79,81,88,96,99,106,114,122,131,140,148]
[null,null,"psconf-",-3,-4,-5,-5,-6,-6,-7,-8,-8,-9,-10,-11,-12,-13,-14,-15]
[null,null,"psconf+",14,14,13,12,12,11,11,10,9,9,8,7,6,5,4,3]
[]
[]
["NV",5,6,7,8,9,10,11,12,13,14,15,16,17,18,19,20,21,22,23,24,25,26,27,28,29,30,31,32,33,34,35,36,37,38,39,40,41,42,43,44,45,46,47,48,49,50,51,52,53,54,55,56,57,58,59,60,61,62,63,64,65,66,67,68,69,70,71,72,73,74,75,76,77,78,79,80,81,82,83,84,85,86,87,88,89,90,91,92,93,94,95]
[null,42,43,44,46,47,48,50,51,52,53,55,56,57,59,60,61,62,64,65,66,68,69,70,72,73,74,75,77,78,79,81,82,83,84,86,87,88,90,91,92,93,95,96,97,99,100,101,103,104,105,106,108,109,110,112,113,114,115,117,118,119,121,122,123,125,126,127,128,130,131,132,134,135,136,137,139,140,141,143,144,145,146,148,149,150,152,153,154,156,157,158]
["V",5,6,7,8,9,10,11,12,13,14,15,16,17,18,19,20,21,22,23,24,25,26,27,28,29,30,31,32,33,34,35,36,37,38,39,40,41,42,43,44,45,46,47,48,49,50,51,52,53,54,55,56,57,58,59,60,61,62,63,64,65,66,67,68,69,70,71,72,73,74,75,76,77,78,79,80,81,82,83,84,85,86,87,88,89,90,91,92,93,94,95]
[null,43,44,46,47,48,49,51,52,53,54,56,57,58,59,61,62,63,64,66,67,68,69,71,72,73,75,76,77,78,80,81,82,83,85,86,87,88,90,91,92,93,95,96,97,99,100,101,102,103,105,106,107,109,110,111,112,114,115,116,117,119,120,121,122,124,125,126,127,129,103,131,132,134,135,136,138,139,140,141,143,144,145,146,148,149,150,151,153,154,155,156]
["FS",10,11,12,13,14,15,16,17,18,19,20,21,22,23,24,25,26,27,28,29,30,31,32,33,34,35,36,37,38,39,40,41,42,43,44,45,46,47,48,49,50,51,52,53,54,55,56,57,58,59,60,61,62,63,64,65,66,67,68,69,70,71,72,73,74,75,76,77,78,79,80,81,82,83,84,85,86,87,88,89,90,91,92,93,94,95,96,97,98,99,100,101,102,103,104,105,106,107,108,109,110,111,112,113,114,115,116,117,118,119,120,121,122,123,124,125,126,127,128,129,130,131,132,133,134,135,136,137,138,139,140,141,142,143,144,145,146,147,148,149,150,151,152,153,154,155,156,157,158,159,160,161,162,163,164,165,166,167,168,169,170,171,172,173,174,175,176,177,178,179,180,181,182,183,184,185,186,187,188,189,190]
[null,40,40,41,42,42,43,44,44,45,45,46,47,48,48,49,50,50,51,52,52,53,54,54,55,56,56,57,58,58,59,60,60,61,62,62,63,64,64,65,66,66,67,68,68,69,70,70,71,72,72,73,74,74,75,76,76,77,78,78,79,80,80,81,82,82,83,84,84,85,86,86,87,88,88,89,90,90,91,92,92,93,94,94,95,96,96,97,98,98,99,100,100,101,102,102,103,104,104,105,106,106,107,108,108,109,110,110,111,112,112,113,114,114,115,116,116,117,118,118,119,120,120,121,122,122,123,124,124,125,126,126,127,128,128,129,130,130,131,132,132,133,134,134,135,136,136,137,138,138,139,140,140,141,142,142,143,144,144,145,146,146,147,148,148,149,450,150,151,152,152,153,154,154,155,156,156,157,158,158,159,160]
[]
["FR",2,3,4,5,6,7,8,9,10,11,12,13,14,15,16,17,18,19,20,21,22,23,24,25,26,27,28,29,30,31,32,33,34,35,36,37,38]
[null,47,50,53,56,59,62,65,68,71,73,76,79,82,85,88,91,94,97,100,103,106,109,112,115,118,121,123,126,129,132,135,138,141,144,147,150,153]
["Kn",2,3,4,5,6,7,8,9,10,11,12,13,14,15,16,17,18,19,20,21,22,23,24,25,26,27,28,29,30,31,32,33,34,35,36,37,38]
[null,49,52,55,58,60,63,66,69,72,74,77,80,83,86,89,91,94,97,100,103,106,108,111,114,117,120,123,126,128,131,134,137,140,143,145,148,151]
["QR",2,3,4,5,6,7,8,9,10,11,12,13,14,15,16,17,18,19,20,21,22,23,24,25,26,27,28,29,30,31,32,33,34,35,36,37,38]
[null,50,53,56,59,61,64,68,70,72,75,78,81,83,86,89,92,94,97,100,103,105,108,111,114,116,119,122,125,127,130,133,136,138,141,144,147,149]
["VS",2,3,4,5,6,7,8,9,10,11,12,13,14,15,16,17,18,19,20,21,22,23,24,25,26,27,28,29,30,31,32,33,34,35,36,37,38]
[null,48,50,53,56,59,62,65,68,71,74,77,79,82,85,88,91,94,97,100,103,106,108,111,114,117,120,123,126,129,132,135,137,140,143,146,149,152]
["WM",2,3,4,5,6,7,8,9,10,11,12,13,14,15,16,17,18,19,20,21,22,23,24,25,26,27,28,29,30,31,32,33,34,35,36,37,38]
[null,48,51,54,58,60,63,65,68,71,74,77,80,83,86,89,91,94,97,100,103,106,109,112,115,117,120,123,126,129,132,135,138,141,143,146,149,152]

{"sheet":"Composite Graph","index":2,"n_rows":41,"n_cols":8,"rows_kept":41,"cut":false,"hidden":false,"merged":[]}
[]
[]
[]
[]
[]
[]
[]
[]
[]
[]
[]
[]
[]
[]
[]
[]
[]
[]
[]
[]
[]
[]
[]
[]
[]
[]
[]
[]
[]
[]
[]
[]
[]
[]
[]
[]
[]
[]
[]
["Nonverbal IQ","Verbal IQ","Full Scale IQ","Fluid Reasoning","Knowledge","Quantitative Reasoning","Visual-Spatial Processing","Working Memory"]
[{"$f":"nviq","v":82},{"$f":"viq","v":95},{"$f":"fsiq","v":88},{"$f":"'SB V Scores'!E41","v":76},{"$f":"'SB V Scores'!E42","v":94},{"$f":"'SB V Scores'!E43","v":92},{"$f":"'SB V Scores'!E44","v":94},{"$f":"'SB V Scores'!E45","v":91}]

{"sheet":"Subtest Graph","index":3,"n_rows":42,"n_cols":10,"rows_kept":42,"cut":false,"hidden":false,"merged":[]}
[]
[]
[]
[]
[]
[]
[]
[]
[]
[]
[]
[]
[]
[]
[]
[]
[]
[]
[]
[]
[]
[]
[]
[]
[]
[]
[]
[]
[]
[]
[]
[]
[]
[]
[]
[]
[]
[]
[]
["FR","KN","QR","VS","WM","FR","KN","QR","VS","WM"]
[{"$f":"'SB V Scores'!P22","v":4},{"$f":"'SB V Scores'!Q22","v":10},{"$f":"'SB V Scores'!R22","v":10},{"$f":"'SB V Scores'!S22","v":8},{"$f":"'SB V Scores'!T22","v":4},{"$f":"'SB V Scores'!U22","v":8},{"$f":"'SB V Scores'!V22","v":8},{"$f":"'SB V Scores'!W22","v":7},{"$f":"'SB V Scores'!X22","v":10},{"$f":"'SB V Scores'!Y22","v":13}]
["FR","KN","QR","VS","WM","FR","KN","QR","VS","WM"]

{"sheet":"SB V vs WJ III Ach","index":4,"n_rows":70,"n_cols":34,"rows_kept":70,"cut":false,"hidden":false,"merged":[[1,1,2,9],[3,1,3,9],[8,9,9,9],[0,1,0,9]]}
[null,"Stanford Binet Intelligence Scales Fifth Edition, Gale H. Roid © Riverside Publishing, 2003. All Rights Reserved"]
[null,"WJ III Test and Cluster Scores Predicted by the SB5 FSIQ, NVIQ, or VIQ Scores"]
[null,null,null,null,null,null,null,null,null,null,null,null,null,null,null,null,null,null,null,0,0.67,1.04,1.28,1.34,1.1399999999999999,1.48,1.56,1.64,1.75,1.88,2.0499999999999998,2.33,2.57]
[null,"WJ III Achievement Predicted By",null,null,null,null,null,null,null,null,null,null,null,null,null,null,null,2,{"$f":"IF(R4=TRUE,1,0)","v":0}]
[null,null,null,null,null,null,null,null,null,null,null,null,null,null,null,null,null,null,{"$f":"IF(R5=TRUE,1,0)","v":0}]
[null,null,null,null,null,null,null,null,null,null,null,null,null,null,null,null,null,null,{"$f":"IF(R6=TRUE,1,0)","v":0},50,25,15,10,9,8,7,6,5,4,3,2,1,"<1"]
[null,null,null,null,null,null,null,null,null,null,null,null,null,null,null,null,null,null,{"$f":"R4","v":2}]
[]
[null,null,null,null,null,null,null,null,null,"Approx. Frequency",null,null,null,null,null,null,null,null,null,7,7,7,null,9,9,9]
[null,null,null,"WJ III",null,"Predicted Score","Diff","Discrepancy SD (+ or -)",".05 Sign",null,null,null,null,null,null,null,null,null,null,12,12,12,null,15,15,15]
[null,"LWI",null,103,null,{"$f":"IF(D11=\"\",\"\",CHOOSE($S$7,T29,Y29,AD29))","v":90.28},{"$f":"IF(D11=\"\",\"\",CHOOSE($S$7,U29,Z29,AE29))","v":12.719999999999999},{"$f":"IF(D11=\"\",\"\",CHOOSE($S$7,V29,AA29,AF29))","v":1.007526727826126},{"$f":"IF(D11=\"\",\"\",CHOOSE($S$7,W29,AB29,AG29))","v":"sgn"},{"$f":"IF(D11=\"\",\"\",CHOOSE($S$7,X29,AC29,AH29))","v":25},null,null,null,null,null,null,null,null,null,10,10,10,null,12,12,12]
[null,"Und Dir",null,null,null,{"$f":"IF(D12=\"\",\"\",CHOOSE($S$7,T30,Y30,AD30))","v":""},{"$f":"IF(D12=\"\",\"\",CHOOSE($S$7,U30,Z30,AE30))","v":""},{"$f":"IF(D12=\"\",\"\",CHOOSE($S$7,V30,AA30,AF30))","v":""},{"$f":"IF(D12=\"\",\"\",CHOOSE($S$7,W30,AB30,AG30))","v":""},{"$f":"IF(D12=\"\",\"\",CHOOSE($S$7,X30,AC30,AH30))","v":""},null,null,null,null,null,null,null,null,null,13,13,13,null,9,9,9]
[null,"Calc",null,80,null,{"$f":"IF(D13=\"\",\"\",CHOOSE($S$7,T31,Y31,AD31))","v":89.2},-9.2000000000000028,-0.76666666666666694,"",25,null,null,null,null,null,null,null,null,null,10,10,10,null,11,12,12]
[null,"Math Fl",null,79,null,92.26,-13.260000000000005,-0.97914456692288809,"sgn",25,null,null,null,null,null,null,null,null,null,8,9,9,null,13,14,13]
[null,"Wrt Fl",null,null,null,"","","","","",null,null,null,null,null,null,null,null,null,9,9,9,null,8,8,8]
[null,"Pass Comp",null,95,null,88.48,6.519999999999996,0.56569607084095053,"",50,null,null,null,null,null,null,null,null,null,11,11,11,null,11,11,11]
[null,"App Prob",null,89,null,89.2,-0.20000000000000284,-1.6666666666666902E-2,"",50,null,null,null,null,null,null,null,null,null,9,9,9,null,12,12,12]
[null,"Wrt Smpl",null,96,null,91.18,4.8199999999999932,0.36861886445757541,"",50,null,null,null,null,null,null,null,null,null,15,15,15,null,13,13,13]
[null,"Wrd Att",null,99,null,93.16,5.8400000000000034,0.42090705006269319,"",50,null,null,null,null,null,null,null,null,null,10,10,10,null,10,11,11]
[null,"Pic Voc",null,null,null,"","","","","",null,null,null,null,null,null,null,null,null,10,10,10,null,9,9,9]
[null,"Rdg Voc",null,null,null,"","","","","",null,null,null,null,null,null,null,null,null,6,7,6,null,8,8,8]
[null,"Quant Con",null,88,null,88.12,-0.12000000000000455,-1.0648697361300443E-2,"",50,null,null,null,null,null,null,null,null,null,8,9,8,null,10,10,10]
[null,null,null,null,null,{"$f":"IF(D23=\"\",\"\",CHOOSE($S$7,T41,Y41,AD41))","v":""},{"$f":"IF(D23=\"\",\"\",CHOOSE($S$7,U41,Z41,AE41))","v":""},"","","",null,null,null,null,null,null,null,null,null,7,8,7,null,7,7,7]
[null,"Bsc Rdg Skills ",null,95,null,90.82,4.1800000000000068,0.3239653102536621,"",50,null,null,null,null,null,null,null,null,null,9,9,9,null,9,9,9]
[null,"Rdg Comp.",null,null,null,"","","","","",null,null,null,null,null,null,null,null,null,7,8,8,null,7,8,7]
[null,"Brd Math ",null,84,null,88.48,-4.480000000000004,-0.38869914070053102,"",50,null,null,null,null,null,null,null,null,null,9,9,9,null,10,10,10]
[null,"Math Calc.",null,null,null,"","","","","",null,null,null,null,null,null,null,null,null,6,7,7,null,7,8,8]
[null,"Math Rsn ",null,null,null,"","","","","",null,null,null,null,null,null,null,null,null,"FSIQ","Diff","Discrepancy SD (+ or -)",".05 Sign",null,"NVIQ","Diff",null,".05 Sign",null,"VIQ","Diff",null,".05 Sign"]
[null,"Written Expr ",null,null,null,"","","","","",null,null,null,null,null,null,null,null,null,{"$f":"IF(fsiq=\"\",\"\",0.57*(fsiq-100)+100)","v":93.16},{"$f":"D11-T29","v":9.8400000000000034},{"$f":"U29/(15*SQRT(1-(0.54)^2))","v":0.77940746869568256},{"$f":"IF(ABS(U29)>IF(agey>11,X9,T9),\"sgn\",\"\")","v":"sgn"},{"$f":"LOOKUP(ABS(V29),$T$3:$AG$6)","v":25},{"$f":"IF(nviq=\"\",\"\",0.54*(nviq-100)+100)","v":90.28},{"$f":"D11-Y29","v":12.719999999999999},{"$f":"Z29/(15*SQRT(1-(0.54)^2))","v":1.007526727826126},{"$f":"IF(ABS(Z29)>IF(agey>11,Y9,U9),\"sgn\",\"\")","v":"sgn"},{"$f":"LOOKUP(ABS(AA29),$T$3:$AG$6)","v":25},{"$f":"IF(viq=\"\",\"\",0.54*(viq-100)+100)","v":97.3},{"$f":"D11-AD29","v":5.7000000000000028},{"$f":"AE29/(15*SQRT(1-(0.54)^2))","v":0.45148603369566986},{"$f":"IF(ABS(AE29)>IF(agey>11,Z9,V9),\"sgn\",\"\")","v":""},{"$f":"LOOKUP(ABS(AF29),$T$3:$AG$6)","v":50}]
[null,"Acad Appl",null,null,null,"","","","","",null,null,null,null,null,null,null,null,null,{"$f":"IF(fsiq=\"\",\"\",0.5*(fsiq-100)+100)","v":94},-94,{"$f":"U30/(15*SQRT(1-(0.5)^2))","v":-7.2361233738433102},"sgn",{"$f":"LOOKUP(ABS(V30),$T$3:$AG$6)","v":"<1"},{"$f":"IF(nviq=\"\",\"\",0.47*(nviq-100)+100)","v":91.54},-91.54,{"$f":"Z30/(15*SQRT(1-(0.47)^2))","v":-6.9138992530132297},"sgn",{"$f":"LOOKUP(ABS(AA30),$T$3:$AG$6)","v":"<1"},{"$f":"IF(viq=\"\",\"\",0.5*(viq-100)+100)","v":97.5},-97.5,{"$f":"AE30/(15*SQRT(1-(0.5)^2))","v":-7.5055534994651358},"sgn",{"$f":"LOOKUP(ABS(AF30),$T$3:$AG$6)","v":"<1"}]
[null,null,null,null,null,null,null,null,null,null,null,null,null,null,null,null,null,null,null,{"$f":"IF(fsiq=\"\",\"\",0.64*(fsiq-100)+100)","v":92.32},-12.319999999999993,{"$f":"U31/(15*SQRT(1-(0.64)^2))","v":-1.0689226369264586},"sgn",15,{"$f":"IF(nviq=\"\",\"\",0.6*(nviq-100)+100)","v":89.2},-9.2000000000000028,{"$f":"Z31/(15*SQRT(1-(0.6)^2))","v":-0.76666666666666694},"",25,{"$f":"IF(viq=\"\",\"\",0.61*(viq-100)+100)","v":96.95},-16.950000000000003,{"$f":"AE31/(15*SQRT(1-(0.61)^2))","v":-1.4260449071057821},"sgn",8]
[null,null,null,null,null,null,null,null,null,null,null,null,null,null,null,null,null,null,null,{"$f":"IF(fsiq=\"\",\"\",0.44*(fsiq-100)+100)","v":94.72},-15.719999999999999,{"$f":"U32/(15*SQRT(1-(0.44)^2))","v":-1.1670407563509198},"sgn",15,{"$f":"IF(nviq=\"\",\"\",0.43*(nviq-100)+100)","v":92.26},-13.260000000000005,{"$f":"Z32/(15*SQRT(1-(0.43)^2))","v":-0.97914456692288809},"sgn",25,{"$f":"IF(viq=\"\",\"\",0.42*(viq-100)+100)","v":97.9},-18.900000000000006,{"$f":"AE32/(15*SQRT(1-(0.42)^2))","v":-1.3883928745719691},"sgn",8]
[null,null,null,null,null,null,null,null,null,null,null,null,null,null,null,null,null,null,null,{"$f":"IF(fsiq=\"\",\"\",0.5*(fsiq-100)+100)","v":94},-94,{"$f":"U33/(15*SQRT(1-(0.5)^2))","v":-7.2361233738433102},"sgn","<1",{"$f":"IF(nviq=\"\",\"\",0.5*(nviq-100)+100)","v":91},-91,{"$f":"Z33/(15*SQRT(1-(0.5)^2))","v":-7.0051832661674602},"sgn","<1",{"$f":"IF(viq=\"\",\"\",0.44*(viq-100)+100)","v":97.8},-97.8,{"$f":"AE33/(15*SQRT(1-(0.44)^2))","v":-7.2605970719541961},"sgn","<1"]
[null,null,null,null,null,null,null,null,null,null,null,null,null,null,null,null,null,null,null,{"$f":"IF(fsiq=\"\",\"\",0.68*(fsiq-100)+100)","v":91.84},3.1599999999999966,{"$f":"U34/(15*SQRT(1-(0.68)^2))","v":0.28732022214405639},"",50,{"$f":"IF(nviq=\"\",\"\",0.64*(nviq-100)+100)","v":88.48},6.519999999999996,{"$f":"Z34/(15*SQRT(1-(0.64)^2))","v":0.56569607084095053},"",50,{"$f":"IF(viq=\"\",\"\",0.64*(viq-100)+100)","v":96.8},-1.7999999999999972,{"$f":"AE34/(15*SQRT(1-(0.64)^2))","v":-0.15617376188860582},"",50]
[null,null,null,null,null,null,null,null,null,null,null,null,null,null,null,null,null,null,null,{"$f":"IF(fsiq=\"\",\"\",0.64*(fsiq-100)+100)","v":92.32},-3.3199999999999932,{"$f":"U35/(15*SQRT(1-(0.64)^2))","v":-0.28805382748342839},"",50,{"$f":"IF(nviq=\"\",\"\",0.6*(nviq-100)+100)","v":89.2},-0.20000000000000284,{"$f":"Z35/(15*SQRT(1-(0.6)^2))","v":-1.6666666666666902E-2},"",50,{"$f":"IF(viq=\"\",\"\",0.62*(viq-100)+100)","v":96.9},-7.9000000000000057,{"$f":"AE35/(15*SQRT(1-(0.62)^2))","v":-0.67125344354719974},"",25]
[null,null,null,null,null,null,null,null,null,null,null,null,null,null,null,null,null,null,null,{"$f":"IF(fsiq=\"\",\"\",0.53*(fsiq-100)+100)","v":93.64},2.3599999999999994,{"$f":"U36/(15*SQRT(1-(0.53)^2))","v":0.18553510721313896},"",50,{"$f":"IF(nviq=\"\",\"\",0.49*(nviq-100)+100)","v":91.18},4.8199999999999932,{"$f":"Z36/(15*SQRT(1-(0.49)^2))","v":0.36861886445757541},"",50,{"$f":"IF(viq=\"\",\"\",0.5*(viq-100)+100)","v":97.5},-1.5,{"$f":"AE36/(15*SQRT(1-(0.5)^2))","v":-0.11547005383792516},"",50]
[null,null,null,null,null,null,null,null,null,null,null,null,null,null,null,null,null,null,null,{"$f":"IF(fsiq=\"\",\"\",0.4*(fsiq-100)+100)","v":95.2},3.7999999999999972,{"$f":"U37/(15*SQRT(1-(0.4)^2))","v":0.27640932763225678},"",50,{"$f":"IF(nviq=\"\",\"\",0.38*(nviq-100)+100)","v":93.16},5.8400000000000034,{"$f":"Z37/(15*SQRT(1-(0.38)^2))","v":0.42090705006269319},"",50,{"$f":"IF(viq=\"\",\"\",0.38*(viq-100)+100)","v":98.1},0.90000000000000568,{"$f":"AE37/(15*SQRT(1-(0.38)^2))","v":6.4865812509662002E-2},"",50]
[null,null,null,null,null,null,null,null,null,null,null,null,null,null,null,null,null,null,null,{"$f":"IF(fsiq=\"\",\"\",0.57*(fsiq-100)+100)","v":93.16},-93.16,{"$f":"U38/(15*SQRT(1-(0.57)^2))","v":-7.5588228423300654},"sgn","<1",{"$f":"IF(nviq=\"\",\"\",0.51*(nviq-100)+100)","v":90.82},-90.82,{"$f":"Z38/(15*SQRT(1-(0.51)^2))","v":-7.038882650056828},"sgn","<1",{"$f":"IF(viq=\"\",\"\",0.57*(viq-100)+100)","v":97.15},-97.15,{"$f":"AE38/(15*SQRT(1-(0.57)^2))","v":-7.882563751957556},"sgn","<1"]
[null,null,null,null,null,null,null,null,null,null,null,null,null,null,null,null,null,null,null,{"$f":"IF(fsiq=\"\",\"\",0.68*(fsiq-100)+100)","v":91.84},-91.84,{"$f":"U39/(15*SQRT(1-(0.68)^2))","v":-8.3504712663639769},"sgn","<1",{"$f":"IF(nviq=\"\",\"\",0.62*(nviq-100)+100)","v":88.84},-88.84,{"$f":"Z39/(15*SQRT(1-(0.62)^2))","v":-7.5486273322447071},"sgn","<1",{"$f":"IF(viq=\"\",\"\",0.65*(viq-100)+100)","v":96.75},-96.75,{"$f":"AE39/(15*SQRT(1-(0.65)^2))","v":-8.4875768649810208},"sgn","<1"]
[null,null,null,null,null,null,null,null,null,null,null,null,null,null,null,null,null,null,null,{"$f":"IF(fsiq=\"\",\"\",0.7*(fsiq-100)+100)","v":91.6},-3.5999999999999943,{"$f":"U40/(15*SQRT(1-(0.7)^2))","v":-0.3360672201667218},"",50,{"$f":"IF(nviq=\"\",\"\",0.66*(nviq-100)+100)","v":88.12},-0.12000000000000455,{"$f":"Z40/(15*SQRT(1-(0.66)^2))","v":-1.0648697361300443E-2},"",50,{"$f":"IF(viq=\"\",\"\",0.67*(viq-100)+100)","v":96.65},-8.6500000000000057,{"$f":"AE40/(15*SQRT(1-(0.67)^2))","v":-0.77680076195811365},"",25]
[null,null,null,null,null,null,null,null,null,null,null,null,null,null,null,null,null,null,null,null,null,null,{"$f":"IF(ABS(U41)>IF(agey>11,X21,T21),\"*\",\"\")","v":""},null,null,null,null,null,null,null,null,null,{"$f":"IF(ABS(AE41)>IF(agey>11,Z21,V21),\"*\",\"\")","v":""}]
[null,null,null,null,null,null,null,null,null,null,null,null,null,null,null,null,null,null,null,{"$f":"IF(fsiq=\"\",\"\",0.54*(fsiq-100)+100)","v":93.52},{"$f":"D24-T42","v":1.480000000000004},{"$f":"U42/(15*SQRT(1-(0.54)^2))","v":0.1172279526087005},{"$f":"IF(ABS(U42)>IF(agey>11,X21,T21),\"sgn\",\"\")","v":""},50,{"$f":"IF(nviq=\"\",\"\",0.51*(nviq-100)+100)","v":90.82},{"$f":"D24-Y42","v":4.1800000000000068},{"$f":"Z42/(15*SQRT(1-(0.51)^2))","v":0.3239653102536621},{"$f":"IF(ABS(Z42)>IF(agey>11,Y21,U21),\"sgn\",\"\")","v":""},50,{"$f":"IF(viq=\"\",\"\",0.51*(viq-100)+100)","v":97.45},{"$f":"D24-AD42","v":-2.4500000000000028},{"$f":"AE42/(15*SQRT(1-(0.51)^2))","v":-0.18988397371327076},{"$f":"IF(ABS(AE42)>IF(agey>11,Z21,V21),\"sgn\",\"\")","v":""},50]
[null,null,null,null,null,null,null,null,null,null,null,null,null,null,null,null,null,null,null,{"$f":"IF(fsiq=\"\",\"\",0.75*(fsiq-100)+100)","v":91},-91,{"$f":"U43/(15*SQRT(1-(0.75)^2))","v":-9.1719378783572481},"sgn","<1",{"$f":"IF(nviq=\"\",\"\",0.71*(nviq-100)+100)","v":87.22},-87.22,{"$f":"Z43/(15*SQRT(1-(0.71)^2))","v":-8.257104275179076},"sgn","<1",{"$f":"IF(viq=\"\",\"\",0.71*(viq-100)+100)","v":96.45},-96.45,{"$f":"AE43/(15*SQRT(1-(0.71)^2))","v":-9.1309069862534038},"sgn","<1"]
[null,null,null,null,null,null,null,null,null,null,null,null,null,null,null,null,null,null,null,{"$f":"IF(fsiq=\"\",\"\",0.66*(fsiq-100)+100)","v":92.08},-8.0799999999999983,{"$f":"U44/(15*SQRT(1-(0.68)^2))","v":-0.73466689712784095},"sgn",25,{"$f":"IF(nviq=\"\",\"\",0.64*(nviq-100)+100)","v":88.48},-4.480000000000004,{"$f":"Z44/(15*SQRT(1-(0.64)^2))","v":-0.38869914070053102},"",50,{"$f":"IF(viq=\"\",\"\",0.66*(viq-100)+100)","v":96.7},-12.700000000000003,{"$f":"AE44/(15*SQRT(1-(0.68)^2))","v":-1.1547363358321268},"sgn",15]
[null,null,null,null,null,null,null,null,null,null,null,null,null,null,null,null,null,null,null,{"$f":"IF(fsiq=\"\",\"\",0.63*(fsiq-100)+100)","v":92.44},-92.44,{"$f":"U45/(15*SQRT(1-(0.63)^2))","v":-7.9354948387611417},"sgn","<1",{"$f":"IF(nviq=\"\",\"\",0.6*(nviq-100)+100)","v":89.2},-89.2,{"$f":"Z45/(15*SQRT(1-(0.6)^2))","v":-7.4333333333333336},"sgn","<1",{"$f":"IF(viq=\"\",\"\",0.6*(viq-100)+100)","v":97},-97,{"$f":"AE45/(15*SQRT(1-(0.6)^2))","v":-8.0833333333333339},"sgn","<1"]
[null,null,null,null,null,null,null,null,null,null,null,null,null,null,null,null,null,null,null,{"$f":"IF(fsiq=\"\",\"\",0.72*(fsiq-100)+100)","v":91.36},-91.36,{"$f":"U46/(15*SQRT(1-(0.72)^2))","v":-8.7765047602431512},"sgn","<1",{"$f":"IF(nviq=\"\",\"\",0.68*(nviq-100)+100)","v":87.76},-87.76,{"$f":"Z46/(15*SQRT(1-(0.68)^2))","v":-7.97950085296279},"sgn","<1",{"$f":"IF(viq=\"\",\"\",0.69*(viq-100)+100)","v":96.55},-96.55,{"$f":"AE46/(15*SQRT(1-(0.69)^2))","v":-8.8927650824026223},"sgn","<1"]
[null,null,null,null,null,null,null,null,null,null,null,null,null,null,null,null,null,null,null,{"$f":"IF(fsiq=\"\",\"\",0.59*(fsiq-100)+100)","v":92.92},-92.92,{"$f":"U47/(15*SQRT(1-(0.59)^2))","v":-7.6723331311855567},"sgn","<1",{"$f":"IF(nviq=\"\",\"\",0.58*(nviq-100)+100)","v":89.56},-89.56,{"$f":"Z47/(15*SQRT(1-(0.58)^2))","v":-7.3294204769199274},"sgn","<1",{"$f":"IF(viq=\"\",\"\",0.53*(viq-100)+100)","v":97.35},-97.35,{"$f":"AE47/(15*SQRT(1-(0.53)^2))","v":-7.6533231725419837},"sgn","<1"]
[null,null,null,null,null,null,null,null,null,null,null,null,null,null,null,null,null,null,null,{"$f":"IF(fsiq=\"\",\"\",0.75*(fsiq-100)+100)","v":91},-91,{"$f":"U48/(15*SQRT(1-(0.75)^2))","v":-9.1719378783572481},"sgn","<1",{"$f":"IF(nviq=\"\",\"\",0.71*(nviq-100)+100)","v":87.22},-87.22,{"$f":"Z48/(15*SQRT(1-(0.71)^2))","v":-8.257104275179076},"sgn","<1",{"$f":"IF(viq=\"\",\"\",0.71*(viq-100)+100)","v":96.45},-96.45,{"$f":"AE48/(15*SQRT(1-(0.71)^2))","v":-9.1309069862534038},"sgn","<1"]
[]
[null,null,null,null,null,null,null,null,null,null,null,null,null,null,null,null,null,null,null,null,{"$f":"D10","v":"WJ III"},{"$f":"F10","v":"Predicted Score"}]
[null,null,null,null,null,null,null,null,null,null,null,null,null,null,null,null,null,null,null,{"$f":"B11","v":"LWI"},{"$f":"D11","v":103},{"$f":"F11","v":90.28}]
[null,null,null,null,null,null,null,null,null,null,null,null,null,null,null,null,null,null,null,{"$f":"B12","v":"Und Dir"},{"$f":"D12","v":0},{"$f":"F12","v":""}]
[null,null,null,null,null,null,null,null,null,null,null,null,null,null,null,null,null,null,null,"Calc",80,89.2]
[null,null,null,null,null,null,null,null,null,null,null,null,null,null,null,null,null,null,null,"Math Fl",79,92.26]
[null,null,null,null,null,null,null,null,null,null,null,null,null,null,null,null,null,null,null,"Wrt Fl",0,""]
[null,null,null,null,null,null,null,null,null,null,null,null,null,null,null,null,null,null,null,"Pass Comp",95,88.48]
[null,null,null,null,null,null,null,null,null,null,null,null,null,null,null,null,null,null,null,"App Prob",89,89.2]
[null,null,null,null,null,null,null,null,null,null,null,null,null,null,null,null,null,null,null,"Wrt Smpl",96,91.18]
[null,null,null,null,null,null,null,null,null,null,null,null,null,null,null,null,null,null,null,"Wrd Att",99,93.16]
[null,null,null,null,null,null,null,null,null,null,null,null,null,null,null,null,null,null,null,"Pic Voc",0,""]
[null,null,null,null,null,null,null,null,null,null,null,null,null,null,null,null,null,null,null,"Rdg Voc",0,""]
[null,null,null,null,null,null,null,null,null,null,null,null,null,null,null,null,null,null,null,"Quant Con",88,88.12]
[]
[null,null,null,null,null,null,null,null,null,null,null,null,null,null,null,null,null,null,null,"Bsc Rdg Skills ",95,90.82]
[null,null,null,null,null,null,null,null,null,null,null,null,null,null,null,null,null,null,null,"Rdg Comp.",0,""]
[null,null,null,null,null,null,null,null,null,null,null,null,null,null,null,null,null,null,null,"Brd Math ",84,88.48]
[null,null,null,null,null,null,null,null,null,null,null,null,null,null,null,null,null,null,null,"Math Calc.",0,""]
[null,null,null,null,null,null,null,null,null,null,null,null,null,null,null,null,null,null,null,"Math Rsn ",0,""]
[null,null,null,null,null,null,null,null,null,null,null,null,null,null,null,null,null,null,null,"Written Expr ",0,""]
[null,null,null,null,null,null,null,null,null,null,null,null,null,null,null,null,null,null,null,"Acad Appl",0,""]

{"sheet":"SB V-WJ III Ach Graph","index":5,"n_rows":70,"n_cols":33,"rows_kept":70,"cut":false,"hidden":false,"merged":[]}
[]
[]
[null,null,null,null,null,null,null,null,null,null,null,null,null,null,null,null,null,null,0,0.67,1.04,1.28,1.34,1.1399999999999999,1.48,1.56,1.64,1.75,1.88,2.0499999999999998,2.33,2.57]
[null,null,null,null,null,null,null,null,null,null,null,null,null,null,null,null,1,{"$f":"IF(Q4=TRUE,1,0)","v":0}]
[null,null,null,null,null,null,null,null,null,null,null,null,null,null,null,null,null,{"$f":"IF(Q5=TRUE,1,0)","v":0}]
[null,null,null,null,null,null,null,null,null,null,null,null,null,null,null,null,null,{"$f":"IF(Q6=TRUE,1,0)","v":0},50,25,15,10,9,8,7,6,5,4,3,2,1,"<1"]
[null,null,null,null,null,null,null,null,null,null,null,null,null,null,null,null,null,{"$f":"Q4","v":1}]
[]
[null,null,null,null,null,null,null,null,null,null,null,null,null,null,null,null,null,null,7,7,7,null,9,9,9]
[null,null,null,null,null,null,null,null,null,null,null,null,null,null,null,null,null,null,12,12,12,null,15,15,15]
[null,null,null,null,null,null,null,null,null,null,null,null,null,null,null,null,null,null,10,10,10,null,12,12,12]
[null,null,null,null,null,null,null,null,null,null,null,null,null,null,null,null,null,null,13,13,13,null,9,9,9]
[null,null,null,null,null,null,null,null,null,null,null,null,null,null,null,null,null,null,10,10,10,null,11,12,12]
[null,null,null,null,null,null,null,null,null,null,null,null,null,null,null,null,null,null,8,9,9,null,13,14,13]
[null,null,null,null,null,null,null,null,null,null,null,null,null,null,null,null,null,null,9,9,9,null,8,8,8]
[null,null,null,null,null,null,null,null,null,null,null,null,null,null,null,null,null,null,11,11,11,null,11,11,11]
[null,null,null,null,null,null,null,null,null,null,null,null,null,null,null,null,null,null,9,9,9,null,12,12,12]
[null,null,null,null,null,null,null,null,null,null,null,null,null,null,null,null,null,null,15,15,15,null,13,13,13]
[null,null,null,null,null,null,null,null,null,null,null,null,null,null,null,null,null,null,10,10,10,null,10,11,11]
[null,null,null,null,null,null,null,null,null,null,null,null,null,null,null,null,null,null,10,10,10,null,9,9,9]
[null,null,null,null,null,null,null,null,null,null,null,null,null,null,null,null,null,null,6,7,6,null,8,8,8]
[null,null,null,null,null,null,null,null,null,null,null,null,null,null,null,null,null,null,8,9,8,null,10,10,10]
[null,null,null,null,null,null,null,null,null,null,null,null,null,null,null,null,null,null,7,8,7,null,7,7,7]
[null,null,null,null,null,null,null,null,null,null,null,null,null,null,null,null,null,null,9,9,9,null,9,9,9]
[null,null,null,null,null,null,null,null,null,null,null,null,null,null,null,null,null,null,7,8,8,null,7,8,7]
[null,null,null,null,null,null,null,null,null,null,null,null,null,null,null,null,null,null,9,9,9,null,10,10,10]
[null,null,null,null,null,null,null,null,null,null,null,null,null,null,null,null,null,null,6,7,7,null,7,8,8]
[null,null,null,null,null,null,null,null,null,null,null,null,null,null,null,null,null,null,"FSIQ","Diff","Discrepancy SD (+ or -)",".05 Sign",null,"NVIQ","Diff",null,".05 Sign",null,"VIQ","Diff",null,".05 Sign"]
[null,null,null,null,null,null,null,null,null,null,null,null,null,null,null,null,null,null,{"$f":"IF(fsiq=\"\",\"\",0.57*(fsiq-100)+100)","v":93.16},{"$f":"C11-S29","v":-93.16},{"$f":"T29/(15*SQRT(1-(0.54)^2))","v":-7.3790243682611552},{"$f":"IF(ABS(T29)>IF(agey>11,W9,S9),\"sgn\",\"\")","v":"sgn"},{"$f":"LOOKUP(ABS(U29),$S$3:$AF$6)","v":"<1"},{"$f":"IF(nviq=\"\",\"\",0.54*(nviq-100)+100)","v":90.28},{"$f":"C11-X29","v":-90.28},{"$f":"Y29/(15*SQRT(1-(0.54)^2))","v":-7.1509051091307114},{"$f":"IF(ABS(Y29)>IF(agey>11,X9,T9),\"sgn\",\"\")","v":"sgn"},{"$f":"LOOKUP(ABS(Z29),$S$3:$AF$6)","v":"<1"},{"$f":"IF(viq=\"\",\"\",0.54*(viq-100)+100)","v":97.3},{"$f":"C11-AC29","v":-97.3},{"$f":"AD29/(15*SQRT(1-(0.54)^2))","v":-7.706945803261168},{"$f":"IF(ABS(AD29)>IF(agey>11,Y9,U9),\"sgn\",\"\")","v":"sgn"},{"$f":"LOOKUP(ABS(AE29),$S$3:$AF$6)","v":"<1"}]
[null,null,null,null,null,null,null,null,null,null,null,null,null,null,null,null,null,null,{"$f":"IF(fsiq=\"\",\"\",0.5*(fsiq-100)+100)","v":94},-94,{"$f":"T30/(15*SQRT(1-(0.5)^2))","v":-7.2361233738433102},"sgn","<1",{"$f":"IF(nviq=\"\",\"\",0.47*(nviq-100)+100)","v":91.54},-91.54,{"$f":"Y30/(15*SQRT(1-(0.47)^2))","v":-6.9138992530132297},"sgn","<1",{"$f":"IF(viq=\"\",\"\",0.5*(viq-100)+100)","v":97.5},-97.5,{"$f":"AD30/(15*SQRT(1-(0.5)^2))","v":-7.5055534994651358},"sgn","<1"]
[null,null,null,null,null,null,null,null,null,null,null,null,null,null,null,null,null,null,{"$f":"IF(fsiq=\"\",\"\",0.64*(fsiq-100)+100)","v":92.32},-92.32,{"$f":"T31/(15*SQRT(1-(0.64)^2))","v":-8.0099787208645061},"sgn","<1",{"$f":"IF(nviq=\"\",\"\",0.6*(nviq-100)+100)","v":89.2},-89.2,{"$f":"Y31/(15*SQRT(1-(0.6)^2))","v":-7.4333333333333336},"sgn","<1",{"$f":"IF(viq=\"\",\"\",0.61*(viq-100)+100)","v":96.95},-96.95,{"$f":"AD31/(15*SQRT(1-(0.61)^2))","v":-8.1566403388734852},"sgn","<1"]
[null,null,null,null,null,null,null,null,null,null,null,null,null,null,null,null,null,null,{"$f":"IF(fsiq=\"\",\"\",0.44*(fsiq-100)+100)","v":94.72},-94.72,{"$f":"T32/(15*SQRT(1-(0.44)^2))","v":-7.0319402316513449},"sgn","<1",{"$f":"IF(nviq=\"\",\"\",0.43*(nviq-100)+100)","v":92.26},-92.26,{"$f":"Y32/(15*SQRT(1-(0.43)^2))","v":-6.8126604633714649},"sgn","<1",{"$f":"IF(viq=\"\",\"\",0.42*(viq-100)+100)","v":97.9},-97.9,{"$f":"AD32/(15*SQRT(1-(0.42)^2))","v":-7.1917281704018912},"sgn","<1"]
[null,null,null,null,null,null,null,null,null,null,null,null,null,null,null,null,null,null,{"$f":"IF(fsiq=\"\",\"\",0.5*(fsiq-100)+100)","v":94},-94,{"$f":"T33/(15*SQRT(1-(0.5)^2))","v":-7.2361233738433102},"sgn","<1",{"$f":"IF(nviq=\"\",\"\",0.5*(nviq-100)+100)","v":91},-91,{"$f":"Y33/(15*SQRT(1-(0.5)^2))","v":-7.0051832661674602},"sgn","<1",{"$f":"IF(viq=\"\",\"\",0.44*(viq-100)+100)","v":97.8},-97.8,{"$f":"AD33/(15*SQRT(1-(0.44)^2))","v":-7.2605970719541961},"sgn","<1"]
[null,null,null,null,null,null,null,null,null,null,null,null,null,null,null,null,null,null,{"$f":"IF(fsiq=\"\",\"\",0.68*(fsiq-100)+100)","v":91.84},-91.84,{"$f":"T34/(15*SQRT(1-(0.68)^2))","v":-8.3504712663639769},"sgn","<1",{"$f":"IF(nviq=\"\",\"\",0.64*(nviq-100)+100)","v":88.48},-88.48,{"$f":"Y34/(15*SQRT(1-(0.64)^2))","v":-7.676808028835481},"sgn","<1",{"$f":"IF(viq=\"\",\"\",0.64*(viq-100)+100)","v":96.8},-96.8,{"$f":"AD34/(15*SQRT(1-(0.64)^2))","v":-8.3986778615650373},"sgn","<1"]
[null,null,null,null,null,null,null,null,null,null,null,null,null,null,null,null,null,null,{"$f":"IF(fsiq=\"\",\"\",0.64*(fsiq-100)+100)","v":92.32},-92.32,{"$f":"T35/(15*SQRT(1-(0.64)^2))","v":-8.0099787208645061},"sgn","<1",{"$f":"IF(nviq=\"\",\"\",0.6*(nviq-100)+100)","v":89.2},-89.2,{"$f":"Y35/(15*SQRT(1-(0.6)^2))","v":-7.4333333333333336},"sgn","<1",{"$f":"IF(viq=\"\",\"\",0.62*(viq-100)+100)","v":96.9},-96.9,{"$f":"AD35/(15*SQRT(1-(0.62)^2))","v":-8.2334757822434952},"sgn","<1"]
[null,null,null,null,null,null,null,null,null,null,null,null,null,null,null,null,null,null,{"$f":"IF(fsiq=\"\",\"\",0.53*(fsiq-100)+100)","v":93.64},-93.64,{"$f":"T36/(15*SQRT(1-(0.53)^2))","v":-7.3616556946772613},"sgn","<1",{"$f":"IF(nviq=\"\",\"\",0.49*(nviq-100)+100)","v":91.18},-91.18,{"$f":"Y36/(15*SQRT(1-(0.49)^2))","v":-6.9731676475605351},"sgn","<1",{"$f":"IF(viq=\"\",\"\",0.5*(viq-100)+100)","v":97.5},-97.5,{"$f":"AD36/(15*SQRT(1-(0.5)^2))","v":-7.5055534994651358},"sgn","<1"]
[null,null,null,null,null,null,null,null,null,null,null,null,null,null,null,null,null,null,{"$f":"IF(fsiq=\"\",\"\",0.4*(fsiq-100)+100)","v":95.2},-95.2,{"$f":"T37/(15*SQRT(1-(0.4)^2))","v":-6.9247810501554916},"sgn","<1",{"$f":"IF(nviq=\"\",\"\",0.38*(nviq-100)+100)","v":93.16},-93.16,{"$f":"Y37/(15*SQRT(1-(0.38)^2))","v":-6.7143323260000809},"sgn","<1",{"$f":"IF(viq=\"\",\"\",0.38*(viq-100)+100)","v":98.1},-98.1,{"$f":"AD37/(15*SQRT(1-(0.38)^2))","v":-7.0703735635531126},"sgn","<1"]
[null,null,null,null,null,null,null,null,null,null,null,null,null,null,null,null,null,null,{"$f":"IF(fsiq=\"\",\"\",0.57*(fsiq-100)+100)","v":93.16},-93.16,{"$f":"T38/(15*SQRT(1-(0.57)^2))","v":-7.5588228423300654},"sgn","<1",{"$f":"IF(nviq=\"\",\"\",0.51*(nviq-100)+100)","v":90.82},-90.82,{"$f":"Y38/(15*SQRT(1-(0.51)^2))","v":-7.038882650056828},"sgn","<1",{"$f":"IF(viq=\"\",\"\",0.57*(viq-100)+100)","v":97.15},-97.15,{"$f":"AD38/(15*SQRT(1-(0.57)^2))","v":-7.882563751957556},"sgn","<1"]
[null,null,null,null,null,null,null,null,null,null,null,null,null,null,null,null,null,null,{"$f":"IF(fsiq=\"\",\"\",0.68*(fsiq-100)+100)","v":91.84},-91.84,{"$f":"T39/(15*SQRT(1-(0.68)^2))","v":-8.3504712663639769},"sgn","<1",{"$f":"IF(nviq=\"\",\"\",0.62*(nviq-100)+100)","v":88.84},-88.84,{"$f":"Y39/(15*SQRT(1-(0.62)^2))","v":-7.5486273322447071},"sgn","<1",{"$f":"IF(viq=\"\",\"\",0.65*(viq-100)+100)","v":96.75},-96.75,{"$f":"AD39/(15*SQRT(1-(0.65)^2))","v":-8.4875768649810208},"sgn","<1"]
[null,null,null,null,null,null,null,null,null,null,null,null,null,null,null,null,null,null,{"$f":"IF(fsiq=\"\",\"\",0.7*(fsiq-100)+100)","v":91.6},-91.6,{"$f":"T40/(15*SQRT(1-(0.7)^2))","v":-8.5510437131310457},"sgn","<1",{"$f":"IF(nviq=\"\",\"\",0.66*(nviq-100)+100)","v":88.12},-88.12,{"$f":"Y40/(15*SQRT(1-(0.66)^2))","v":-7.8196934289813296},"sgn","<1",{"$f":"IF(viq=\"\",\"\",0.67*(viq-100)+100)","v":96.65},-96.65,{"$f":"AD40/(15*SQRT(1-(0.67)^2))","v":-8.6795137159828482},"sgn","<1"]
[null,null,null,null,null,null,null,null,null,null,null,null,null,null,null,null,null,null,null,null,null,{"$f":"IF(ABS(T41)>IF(agey>11,W21,S21),\"*\",\"\")","v":""},null,null,null,null,null,null,null,null,null,{"$f":"IF(ABS(AD41)>IF(agey>11,Y21,U21),\"*\",\"\")","v":""}]
[null,null,null,null,null,null,null,null,null,null,null,null,null,null,null,null,null,null,{"$f":"IF(fsiq=\"\",\"\",0.54*(fsiq-100)+100)","v":93.52},{"$f":"C24-S42","v":-93.52},{"$f":"T42/(15*SQRT(1-(0.54)^2))","v":-7.4075392756524598},{"$f":"IF(ABS(T42)>IF(agey>11,W21,S21),\"sgn\",\"\")","v":"sgn"},{"$f":"LOOKUP(ABS(U42),$S$3:$AF$6)","v":"<1"},{"$f":"IF(nviq=\"\",\"\",0.51*(nviq-100)+100)","v":90.82},{"$f":"C24-X42","v":-90.82},{"$f":"Y42/(15*SQRT(1-(0.51)^2))","v":-7.038882650056828},{"$f":"IF(ABS(Y42)>IF(agey>11,X21,T21),\"sgn\",\"\")","v":"sgn"},{"$f":"LOOKUP(ABS(Z42),$S$3:$AF$6)","v":"<1"},{"$f":"IF(viq=\"\",\"\",0.51*(viq-100)+100)","v":97.45},{"$f":"C24-AC42","v":-97.45},{"$f":"AD42/(15*SQRT(1-(0.51)^2))","v":-7.5527319340237611},{"$f":"IF(ABS(AD42)>IF(agey>11,Y21,U21),\"sgn\",\"\")","v":"sgn"},{"$f":"LOOKUP(ABS(AE42),$S$3:$AF$6)","v":"<1"}]
[null,null,null,null,null,null,null,null,null,null,null,null,null,null,null,null,null,null,{"$f":"IF(fsiq=\"\",\"\",0.75*(fsiq-100)+100)","v":91},-91,{"$f":"T43/(15*SQRT(1-(0.75)^2))","v":-9.1719378783572481},"sgn","<1",{"$f":"IF(nviq=\"\",\"\",0.71*(nviq-100)+100)","v":87.22},-87.22,{"$f":"Y43/(15*SQRT(1-(0.71)^2))","v":-8.257104275179076},"sgn","<1",{"$f":"IF(viq=\"\",\"\",0.71*(viq-100)+100)","v":96.45},-96.45,{"$f":"AD43/(15*SQRT(1-(0.71)^2))","v":-9.1309069862534038},"sgn","<1"]
[null,null,null,null,null,null,null,null,null,null,null,null,null,null,null,null,null,null,{"$f":"IF(fsiq=\"\",\"\",0.66*(fsiq-100)+100)","v":92.08},-92.08,{"$f":"T44/(15*SQRT(1-(0.68)^2))","v":-8.3722930553875745},"sgn","<1",{"$f":"IF(nviq=\"\",\"\",0.64*(nviq-100)+100)","v":88.48},-88.48,{"$f":"Y44/(15*SQRT(1-(0.64)^2))","v":-7.676808028835481},"sgn","<1",{"$f":"IF(viq=\"\",\"\",0.66*(viq-100)+100)","v":96.7},-96.7,{"$f":"AD44/(15*SQRT(1-(0.68)^2))","v":-8.7923624940918614},"sgn","<1"]
[null,null,null,null,null,null,null,null,null,null,null,null,null,null,null,null,null,null,{"$f":"IF(fsiq=\"\",\"\",0.63*(fsiq-100)+100)","v":92.44},-92.44,{"$f":"T45/(15*SQRT(1-(0.63)^2))","v":-7.9354948387611417},"sgn","<1",{"$f":"IF(nviq=\"\",\"\",0.6*(nviq-100)+100)","v":89.2},-89.2,{"$f":"Y45/(15*SQRT(1-(0.6)^2))","v":-7.4333333333333336},"sgn","<1",{"$f":"IF(viq=\"\",\"\",0.6*(viq-100)+100)","v":97},-97,{"$f":"AD45/(15*SQRT(1-(0.6)^2))","v":-8.0833333333333339},"sgn","<1"]
[null,null,null,null,null,null,null,null,null,null,null,null,null,null,null,null,null,null,{"$f":"IF(fsiq=\"\",\"\",0.72*(fsiq-100)+100)","v":91.36},-91.36,{"$f":"T46/(15*SQRT(1-(0.72)^2))","v":-8.7765047602431512},"sgn","<1",{"$f":"IF(nviq=\"\",\"\",0.68*(nviq-100)+100)","v":87.76},-87.76,{"$f":"Y46/(15*SQRT(1-(0.68)^2))","v":-7.97950085296279},"sgn","<1",{"$f":"IF(viq=\"\",\"\",0.69*(viq-100)+100)","v":96.55},-96.55,{"$f":"AD46/(15*SQRT(1-(0.69)^2))","v":-8.8927650824026223},"sgn","<1"]
[null,null,null,null,null,null,null,null,null,null,null,null,null,null,null,null,null,null,{"$f":"IF(fsiq=\"\",\"\",0.59*(fsiq-100)+100)","v":92.92},-92.92,{"$f":"T47/(15*SQRT(1-(0.59)^2))","v":-7.6723331311855567},"sgn","<1",{"$f":"IF(nviq=\"\",\"\",0.58*(nviq-100)+100)","v":89.56},-89.56,{"$f":"Y47/(15*SQRT(1-(0.58)^2))","v":-7.3294204769199274},"sgn","<1",{"$f":"IF(viq=\"\",\"\",0.53*(viq-100)+100)","v":97.35},-97.35,{"$f":"AD47/(15*SQRT(1-(0.53)^2))","v":-7.6533231725419837},"sgn","<1"]
[null,null,null,null,null,null,null,null,null,null,null,null,null,null,null,null,null,null,{"$f":"IF(fsiq=\"\",\"\",0.75*(fsiq-100)+100)","v":91},-91,{"$f":"T48/(15*SQRT(1-(0.75)^2))","v":-9.1719378783572481},"sgn","<1",{"$f":"IF(nviq=\"\",\"\",0.71*(nviq-100)+100)","v":87.22},-87.22,{"$f":"Y48/(15*SQRT(1-(0.71)^2))","v":-8.257104275179076},"sgn","<1",{"$f":"IF(viq=\"\",\"\",0.71*(viq-100)+100)","v":96.45},-96.45,{"$f":"AD48/(15*SQRT(1-(0.71)^2))","v":-9.1309069862534038},"sgn","<1"]
[]
[null,null,null,null,null,null,null,null,null,null,null,null,null,null,null,null,null,null,null,{"$f":"'SB V vs WJ III Ach'!D10","v":"WJ III"},{"$f":"'SB V vs WJ III Ach'!F10","v":"Predicted Score"}]
[null,null,null,null,null,null,null,null,null,null,null,null,null,null,null,null,null,null,{"$f":"'SB V vs WJ III Ach'!B11","v":"LWI"},{"$f":"'SB V vs WJ III Ach'!D11","v":103},{"$f":"'SB V vs WJ III Ach'!F11","v":90.28}]
[null,null,null,null,null,null,null,null,null,null,null,null,null,null,null,null,null,null,{"$f":"'SB V vs WJ III Ach'!B12","v":"Und Dir"},{"$f":"'SB V vs WJ III Ach'!D12","v":0},{"$f":"'SB V vs WJ III Ach'!F12","v":""}]
[null,null,null,null,null,null,null,null,null,null,null,null,null,null,null,null,null,null,{"$f":"'SB V vs WJ III Ach'!B13","v":"Calc"},{"$f":"'SB V vs WJ III Ach'!D13","v":80},{"$f":"'SB V vs WJ III Ach'!F13","v":89.2}]
[null,null,null,null,null,null,null,null,null,null,null,null,null,null,null,null,null,null,{"$f":"'SB V vs WJ III Ach'!B14","v":"Math Fl"},{"$f":"'SB V vs WJ III Ach'!D14","v":79},{"$f":"'SB V vs WJ III Ach'!F14","v":92.26}]
[null,null,null,null,null,null,null,null,null,null,null,null,null,null,null,null,null,null,{"$f":"'SB V vs WJ III Ach'!B15","v":"Wrt Fl"},{"$f":"'SB V vs WJ III Ach'!D15","v":0},{"$f":"'SB V vs WJ III Ach'!F15","v":""}]
[null,null,null,null,null,null,null,null,null,null,null,null,null,null,null,null,null,null,{"$f":"'SB V vs WJ III Ach'!B16","v":"Pass Comp"},{"$f":"'SB V vs WJ III Ach'!D16","v":95},{"$f":"'SB V vs WJ III Ach'!F16","v":88.48}]
[null,null,null,null,null,null,null,null,null,null,null,null,null,null,null,null,null,null,{"$f":"'SB V vs WJ III Ach'!B17","v":"App Prob"},{"$f":"'SB V vs WJ III Ach'!D17","v":89},{"$f":"'SB V vs WJ III Ach'!F17","v":89.2}]
[null,null,null,null,null,null,null,null,null,null,null,null,null,null,null,null,null,null,{"$f":"'SB V vs WJ III Ach'!B18","v":"Wrt Smpl"},{"$f":"'SB V vs WJ III Ach'!D18","v":96},{"$f":"'SB V vs WJ III Ach'!F18","v":91.18}]
[null,null,null,null,null,null,null,null,null,null,null,null,null,null,null,null,null,null,{"$f":"'SB V vs WJ III Ach'!B19","v":"Wrd Att"},{"$f":"'SB V vs WJ III Ach'!D19","v":99},{"$f":"'SB V vs WJ III Ach'!F19","v":93.16}]
[null,null,null,null,null,null,null,null,null,null,null,null,null,null,null,null,null,null,{"$f":"'SB V vs WJ III Ach'!B20","v":"Pic Voc"},{"$f":"'SB V vs WJ III Ach'!D20","v":0},{"$f":"'SB V vs WJ III Ach'!F20","v":""}]
[null,null,null,null,null,null,null,null,null,null,null,null,null,null,null,null,null,null,{"$f":"'SB V vs WJ III Ach'!B21","v":"Rdg Voc"},{"$f":"'SB V vs WJ III Ach'!D21","v":0},{"$f":"'SB V vs WJ III Ach'!F21","v":""}]
[null,null,null,null,null,null,null,null,null,null,null,null,null,null,null,null,null,null,{"$f":"'SB V vs WJ III Ach'!B22","v":"Quant Con"},{"$f":"'SB V vs WJ III Ach'!D22","v":88},{"$f":"'SB V vs WJ III Ach'!F22","v":88.12}]
[]
[null,null,null,null,null,null,null,null,null,null,null,null,null,null,null,null,null,null,{"$f":"'SB V vs WJ III Ach'!B24","v":"Bsc Rdg Skills "},{"$f":"'SB V vs WJ III Ach'!D24","v":95},{"$f":"'SB V vs WJ III Ach'!F24","v":90.82}]
[null,null,null,null,null,null,null,null,null,null,null,null,null,null,null,null,null,null,{"$f":"'SB V vs WJ III Ach'!B25","v":"Rdg Comp."},{"$f":"'SB V vs WJ III Ach'!D25","v":0},{"$f":"'SB V vs WJ III Ach'!F25","v":""}]
[null,null,null,null,null,null,null,null,null,null,null,null,null,null,null,null,null,null,{"$f":"'SB V vs WJ III Ach'!B26","v":"Brd Math "},{"$f":"'SB V vs WJ III Ach'!D26","v":84},{"$f":"'SB V vs WJ III Ach'!F26","v":88.48}]
[null,null,null,null,null,null,null,null,null,null,null,null,null,null,null,null,null,null,{"$f":"'SB V vs WJ III Ach'!B27","v":"Math Calc."},{"$f":"'SB V vs WJ III Ach'!D27","v":0},{"$f":"'SB V vs WJ III Ach'!F27","v":""}]
[null,null,null,null,null,null,null,null,null,null,null,null,null,null,null,null,null,null,{"$f":"'SB V vs WJ III Ach'!B28","v":"Math Rsn "},{"$f":"'SB V vs WJ III Ach'!D28","v":0},{"$f":"'SB V vs WJ III Ach'!F28","v":""}]
[null,null,null,null,null,null,null,null,null,null,null,null,null,null,null,null,null,null,{"$f":"'SB V vs WJ III Ach'!B29","v":"Written Expr "},{"$f":"'SB V vs WJ III Ach'!D29","v":0},{"$f":"'SB V vs WJ III Ach'!F29","v":""}]
[null,null,null,null,null,null,null,null,null,null,null,null,null,null,null,null,null,null,{"$f":"'SB V vs WJ III Ach'!B30","v":"Acad Appl"},{"$f":"'SB V vs WJ III Ach'!D30","v":0},{"$f":"'SB V vs WJ III Ach'!F30","v":""}]